chmod +x ../build.sh
../build.sh -Dembed=true && mv ../build/release/lc0 Leela-dag-preview-pro-62D00381-551644D7
The Meson build system
Version: 1.12.0
Source dir: /tmp/tmpvii0pu19/Leela-dag-preview/Leela-dag-preview-tmp
Build dir: /tmp/tmpvii0pu19/Leela-dag-preview/Leela-dag-preview-tmp/build/release
Build type: native build
DEPRECATION: WrapDB v1 is deprecated, updated using `meson wrap update zlib`
Project name: lc0
Project version: undefined
C++ compiler for the host machine: c++ (gcc 11.4.0 "c++ (Ubuntu 11.4.0-1ubuntu1~22.04) 11.4.0")
C++ linker for the host machine: c++ ld.bfd 2.38
Host machine cpu family: x86_64
Host machine cpu: x86_64
Compiler for C++ supports arguments -march=native: YES
Program scripts/compile_proto.py found: YES (/usr/bin/python3 /tmp/tmpvii0pu19/Leela-dag-preview/Leela-dag-preview-tmp/scripts/compile_proto.py)
Program git found: YES (/usr/bin/git)
meson.build:92: WARNING: Failed to parse short revision. Use git clone instead of downloading the archive from GitHub.
Message: Using build identifier "git.unknown".
Configuring build_id.h using configuration
Found pkg-config: YES (/usr/bin/pkg-config) 0.29.2
Found CMake: /usr/bin/cmake (3.22.1)
Run-time dependency absl_flat_hash_map found: NO (tried pkg-config and cmake)
Run-time dependency absl found: NO (tried pkg-config and cmake)
Looking for a fallback subproject for the dependency absl_flat_hash_map (modules: absl::flat_hash_map)
Downloading abseil-cpp source from https://github.com/abseil/abseil-cpp/releases/download/20240722.0/abseil-cpp-20240722.0.tar.gz
Executing subproject abseil-cpp for machine: host
abseil-cpp| Project name: abseil-cpp
abseil-cpp| Project version: 20240722.0
abseil-cpp| C++ compiler for the host machine: c++ (gcc 11.4.0 "c++ (Ubuntu 11.4.0-1ubuntu1~22.04) 11.4.0")
abseil-cpp| C++ linker for the host machine: c++ ld.bfd 2.38
abseil-cpp| Compiler for C++ supports arguments /DNOMINMAX: NO
abseil-cpp| Compiler for C++ supports arguments -Wno-sign-compare: YES
abseil-cpp| Compiler for C++ supports arguments -Wno-gcc-compat: NO
abseil-cpp| Compiler for C++ supports arguments -maes: YES
abseil-cpp| Compiler for C++ supports arguments -msse4.1: YES
abseil-cpp| Checking if "atomic builtins" links: YES
abseil-cpp| Run-time dependency threads found: YES
abseil-cpp| Run-time dependency appleframeworks found: NO (tried framework)
abseil-cpp| Build targets in project: 15
abseil-cpp| Subproject abseil-cpp finished.
Dependency absl_flat_hash_map (modules: absl::flat_hash_map) for host machine from subproject subprojects/abseil-cpp-20240722.0 found: YES 20240722.0
Run-time dependency libhwy found: NO (tried pkg-config and cmake)
Looking for a fallback subproject for the dependency libhwy
Cloning into 'highway'...
Executing subproject highway for machine: host
highway| Project name: hwy
highway| Project version: 1.4.0
highway| C++ compiler for the host machine: c++ (gcc 11.4.0 "c++ (Ubuntu 11.4.0-1ubuntu1~22.04) 11.4.0")
highway| C++ linker for the host machine: c++ ld.bfd 2.38
highway| Compiler for C++ supports arguments -Wno-gnu-zero-variadic-macro-arguments: NO
highway| Checking if define "__EMSCRIPTEN__" exists: NO
highway| Checking if define "__riscv" exists: NO
highway| Has header "sys/auxv.h" : YES
highway| Has header "asm/hwcap.h" : NO
highway| Compiler for C++ supports link arguments -Wl,--version-script=/tmp/tmpvii0pu19/Leela-dag-preview/Leela-dag-preview-tmp/subprojects/highway/hwy/hwy.version: YES
highway| First supported link argument: -Wl,--version-script=/tmp/tmpvii0pu19/Leela-dag-preview/Leela-dag-preview-tmp/subprojects/highway/hwy/hwy.version
highway| Found pkg-config: YES (/usr/bin/pkg-config) 0.29.2
highway| Dependency threads for host machine found: YES unknown (cached)
highway| Run-time dependency GTest found: YES 1.11.0
highway| Build targets in project: 19
highway| Subproject highway finished.
Dependency libhwy for host machine from subproject subprojects/highway found: YES 1.4.0
Dependency threads for host machine found: YES unknown (cached)
Library dl found: YES
Run-time dependency tensorflow_cc found: NO (tried pkg-config and cmake)
Run-time dependency accelerate found: NO (tried pkg-config and cmake)
Library mkl_rt found: NO
Library mklml found: NO
Library dnnl found: NO
Library openblas.dll found: NO
Library openblas found: YES
Has header "openblas_config.h" : YES
Run-time dependency eigen3 found: NO (tried pkg-config and cmake)
Looking for a fallback subproject for the dependency eigen3
Downloading eigen source from https://gitlab.com/libeigen/eigen/-/archive/3.4.0/eigen-3.4.0.tar.bz2
Downloading file of unknown size.
Downloading eigen patch from https://wrapdb.mesonbuild.com/v2/eigen_3.4.0-2/get_patch
Executing subproject eigen for machine: host
eigen| Project name: eigen
eigen| Project version: 3.4.0
eigen| C++ compiler for the host machine: c++ (gcc 11.4.0 "c++ (Ubuntu 11.4.0-1ubuntu1~22.04) 11.4.0")
eigen| C++ linker for the host machine: c++ ld.bfd 2.38
eigen| Build targets in project: 19
eigen| Subproject eigen finished.
Dependency eigen3 for host machine from subproject subprojects/eigen-3.4.0 found: YES 3.4.0
Has header "Eigen/Core" : YES
Program ispc found: NO
Library OpenCL found: NO
Run-time dependency opencl found: NO
Message: Looking for nvcc in: /opt/cuda/lib64/bin/nvcc, /usr/local/cuda/lib64/bin/nvcc, /usr/lib/cuda/lib64/bin/nvcc, nvcc, /usr/local/cuda/bin/nvcc, /opt/cuda/bin/nvcc
Library cublas found: YES
Library cudnn found: NO
Library cudart found: YES
Program nvcc found: YES (/usr/local/cuda/bin/nvcc)
Message: Detected NVCC C++ standard support: 20
Message: Detected maximum CUDA architecture: 1200
Message: Building with CUTLASS support
Cloning into 'cutlass'...
Updating files: 87% (6872/7897)
Updating files: 88% (6950/7897)
Updating files: 89% (7029/7897)
Updating files: 90% (7108/7897)
Updating files: 91% (7187/7897)
Updating files: 92% (7266/7897)
Updating files: 93% (7345/7897)
Updating files: 94% (7424/7897)
Updating files: 95% (7503/7897)
Updating files: 96% (7582/7897)
Updating files: 97% (7661/7897)
Updating files: 98% (7740/7897)
Updating files: 99% (7819/7897)
Updating files: 100% (7897/7897)
Updating files: 100% (7897/7897), done.
HEAD is now at 4370102f v4.4.1 update (#3080)
Executing subproject cutlass for machine: host
cutlass| Project name: cutlass
cutlass| Project version: undefined
cutlass| C++ compiler for the host machine: c++ (gcc 11.4.0 "c++ (Ubuntu 11.4.0-1ubuntu1~22.04) 11.4.0")
cutlass| C++ linker for the host machine: c++ ld.bfd 2.38
cutlass| Build targets in project: 19
cutlass| Subproject cutlass finished.
Library onnxruntime found: NO
Run-time dependency appleframeworks found: NO (tried framework)
Run-time dependency zlib found: YES 1.2.11
Run-time dependency hwloc found: NO (tried pkg-config and cmake)
Configuring numa_config.h using configuration
Configuring trace_config.h using configuration
Library atomic found: YES
Checking for type "_Float16" : NO
Configuring default_search.h using configuration
Configuring default_backend.h using configuration
Dependency gtest for host machine found: YES 1.11.0 (cached)
Run-time dependency GMock found: YES (building self)
Build targets in project: 32
lc0 undefined
Subprojects (for host machine)
abseil-cpp: YES
cutlass : YES
eigen : YES
highway : YES
User defined options
buildtype : release
embed : true
prefix : /usr/local
Found ninja-1.10.1 at /usr/bin/ninja
INFO: autodetecting backend as ninja
INFO: calculating backend command to run: /usr/bin/ninja -C /tmp/tmpvii0pu19/Leela-dag-preview/Leela-dag-preview-tmp/build/release
ninja: Entering directory `/tmp/tmpvii0pu19/Leela-dag-preview/Leela-dag-preview-tmp/build/release'
[1/362] Compiling C++ object subprojects/abseil-cpp-20240722.0/libabsl_base.a.p/absl_base_internal_poison.cc.o
[2/362] Compiling C++ object subprojects/abseil-cpp-20240722.0/libabsl_base.a.p/absl_base_internal_unscaledcycleclock.cc.o
[3/362] Compiling C++ object subprojects/abseil-cpp-20240722.0/libabsl_strings.a.p/absl_strings_internal_utf8.cc.o
[4/362] Compiling C++ object subprojects/abseil-cpp-20240722.0/libabsl_crc.a.p/absl_crc_internal_cpu_detect.cc.o
[5/362] Compiling C++ object subprojects/abseil-cpp-20240722.0/libabsl_strings.a.p/absl_strings_internal_ostringstream.cc.o
[6/362] Compiling C++ object subprojects/abseil-cpp-20240722.0/libabsl_base.a.p/absl_base_internal_strerror.cc.o
[7/362] Compiling C++ object subprojects/abseil-cpp-20240722.0/libabsl_profiling.a.p/absl_profiling_internal_periodic_sampler.cc.o
[8/362] Compiling C++ object subprojects/abseil-cpp-20240722.0/libabsl_base.a.p/absl_base_internal_spinlock_wait.cc.o
[9/362] Compiling C++ object subprojects/abseil-cpp-20240722.0/libabsl_debugging.a.p/absl_debugging_failure_signal_handler.cc.o
[10/362] Compiling C++ object subprojects/abseil-cpp-20240722.0/libabsl_strings.a.p/absl_strings_internal_cord_rep_btree_navigator.cc.o
[11/362] Compiling C++ object subprojects/abseil-cpp-20240722.0/libabsl_crc.a.p/absl_crc_internal_crc_x86_arm_combined.cc.o
[12/362] Compiling C++ object subprojects/abseil-cpp-20240722.0/libabsl_debugging.a.p/absl_debugging_leak_check.cc.o
[13/362] Compiling C++ object subprojects/abseil-cpp-20240722.0/libabsl_debugging.a.p/absl_debugging_internal_address_is_readable.cc.o
[14/362] Compiling C++ object subprojects/abseil-cpp-20240722.0/libabsl_strings.a.p/absl_strings_internal_pow10_helper.cc.o
[15/362] Compiling C++ object subprojects/abseil-cpp-20240722.0/libabsl_base.a.p/absl_base_internal_scoped_set_env.cc.o
[16/362] Compiling C++ object subprojects/abseil-cpp-20240722.0/libabsl_debugging.a.p/absl_debugging_internal_demangle.cc.o
[17/362] Compiling C++ object subprojects/abseil-cpp-20240722.0/libabsl_debugging.a.p/absl_debugging_internal_utf8_for_code_point.cc.o
[18/362] Compiling C++ object subprojects/abseil-cpp-20240722.0/libabsl_strings.a.p/absl_strings_internal_cord_rep_consume.cc.o
[19/362] Compiling C++ object subprojects/abseil-cpp-20240722.0/libabsl_strings.a.p/absl_strings_internal_memutil.cc.o
[20/362] Compiling C++ object subprojects/abseil-cpp-20240722.0/libabsl_strings.a.p/absl_strings_internal_damerau_levenshtein_distance.cc.o
[21/362] Compiling C++ object subprojects/abseil-cpp-20240722.0/libabsl_strings.a.p/absl_strings_internal_str_format_arg.cc.o
[22/362] Compiling C++ object subprojects/abseil-cpp-20240722.0/libabsl_strings.a.p/absl_strings_internal_cord_rep_btree_reader.cc.o
[23/362] Compiling C++ object subprojects/abseil-cpp-20240722.0/libabsl_base.a.p/absl_base_log_severity.cc.o
[24/362] Compiling C++ object subprojects/abseil-cpp-20240722.0/libabsl_random.a.p/absl_random_internal_randen_round_keys.cc.o
[25/362] Compiling C++ object subprojects/abseil-cpp-20240722.0/libabsl_random.a.p/absl_random_internal_randen_detect.cc.o
[26/362] Compiling C++ object subprojects/abseil-cpp-20240722.0/libabsl_debugging.a.p/absl_debugging_internal_demangle_rust.cc.o
[27/362] Compiling C++ object subprojects/abseil-cpp-20240722.0/libabsl_strings.a.p/absl_strings_internal_escaping.cc.o
[28/362] Compiling C++ object subprojects/abseil-cpp-20240722.0/libabsl_strings.a.p/absl_strings_internal_cordz_functions.cc.o
[29/362] Compiling C++ object subprojects/abseil-cpp-20240722.0/libabsl_strings.a.p/absl_strings_internal_cordz_handle.cc.o
[30/362] Compiling C++ object subprojects/abseil-cpp-20240722.0/libabsl_debugging.a.p/absl_debugging_internal_elf_mem_image.cc.o
[31/362] Compiling C++ object subprojects/abseil-cpp-20240722.0/libabsl_crc.a.p/absl_crc_internal_crc.cc.o
[32/362] Compiling C++ object subprojects/abseil-cpp-20240722.0/libabsl_strings.a.p/absl_strings_ascii.cc.o
[33/362] Compiling C++ object subprojects/abseil-cpp-20240722.0/libabsl_debugging.a.p/absl_debugging_internal_stack_consumption.cc.o
[34/362] Compiling C++ object subprojects/abseil-cpp-20240722.0/libabsl_strings.a.p/absl_strings_internal_str_format_extension.cc.o
[35/362] Compiling C++ object subprojects/abseil-cpp-20240722.0/libabsl_debugging.a.p/absl_debugging_internal_vdso_support.cc.o
[36/362] Compiling C++ object subprojects/abseil-cpp-20240722.0/libabsl_strings.a.p/absl_strings_internal_cordz_info.cc.o
[37/362] Compiling C++ object subprojects/abseil-cpp-20240722.0/libabsl_strings.a.p/absl_strings_internal_cord_internal.cc.o
[38/362] Compiling C++ object subprojects/abseil-cpp-20240722.0/libabsl_strings.a.p/absl_strings_cord_analysis.cc.o
[39/362] Compiling C++ object subprojects/abseil-cpp-20240722.0/libabsl_hash.a.p/absl_hash_internal_low_level_hash.cc.o
[40/362] Compiling C++ object subprojects/abseil-cpp-20240722.0/libabsl_strings.a.p/absl_strings_cord_buffer.cc.o
[41/362] Compiling C++ object subprojects/abseil-cpp-20240722.0/libabsl_strings.a.p/absl_strings_escaping.cc.o
[42/362] Compiling C++ object subprojects/abseil-cpp-20240722.0/libabsl_base.a.p/absl_base_internal_cycleclock.cc.o
[43/362] Compiling C++ object subprojects/abseil-cpp-20240722.0/libabsl_base.a.p/absl_base_internal_raw_logging.cc.o
[44/362] Compiling C++ object subprojects/abseil-cpp-20240722.0/libabsl_strings.a.p/absl_strings_charconv.cc.o
[45/362] Compiling C++ object subprojects/abseil-cpp-20240722.0/libabsl_hash.a.p/absl_hash_internal_hash.cc.o
[46/362] Compiling C++ object subprojects/abseil-cpp-20240722.0/libabsl_base.a.p/absl_base_internal_low_level_alloc.cc.o
[47/362] Compiling C++ object subprojects/abseil-cpp-20240722.0/libabsl_base.a.p/absl_base_internal_sysinfo.cc.o
[48/362] Compiling C++ object subprojects/abseil-cpp-20240722.0/libabsl_random.a.p/absl_random_seed_gen_exception.cc.o
[49/362] Compiling C++ object subprojects/abseil-cpp-20240722.0/libabsl_random.a.p/absl_random_gaussian_distribution.cc.o
[50/362] Compiling C++ object subprojects/abseil-cpp-20240722.0/libabsl_types.a.p/absl_types_bad_any_cast.cc.o
[51/362] Compiling C++ object subprojects/abseil-cpp-20240722.0/libabsl_strings.a.p/absl_strings_internal_charconv_bigint.cc.o
[52/362] Compiling C++ object subprojects/abseil-cpp-20240722.0/libabsl_base.a.p/absl_base_internal_spinlock.cc.o
[53/362] Compiling C++ object subprojects/abseil-cpp-20240722.0/libabsl_strings.a.p/absl_strings_internal_charconv_parse.cc.o
[54/362] Compiling C++ object subprojects/abseil-cpp-20240722.0/libabsl_debugging.a.p/absl_debugging_stacktrace.cc.o
[55/362] Compiling C++ object subprojects/abseil-cpp-20240722.0/libabsl_strings.a.p/absl_strings_substitute.cc.o
[56/362] Compiling C++ object subprojects/abseil-cpp-20240722.0/libabsl_debugging.a.p/absl_debugging_internal_decode_rust_punycode.cc.o
[57/362] Compiling C++ object subprojects/abseil-cpp-20240722.0/libabsl_strings.a.p/absl_strings_string_view.cc.o
[58/362] Compiling C++ object subprojects/abseil-cpp-20240722.0/libabsl_strings.a.p/absl_strings_str_split.cc.o
[59/362] Compiling C++ object subprojects/abseil-cpp-20240722.0/libabsl_strings.a.p/absl_strings_internal_stringify_sink.cc.o
[60/362] Compiling C++ object subprojects/abseil-cpp-20240722.0/libabsl_strings.a.p/absl_strings_str_cat.cc.o
[61/362] Compiling C++ object subprojects/abseil-cpp-20240722.0/libabsl_synchronization.a.p/absl_synchronization_internal_win32_waiter.cc.o
[62/362] Compiling C++ object subprojects/abseil-cpp-20240722.0/libabsl_base.a.p/absl_base_internal_throw_delegate.cc.o
[63/362] Compiling C++ object subprojects/abseil-cpp-20240722.0/libabsl_random.a.p/absl_random_internal_randen.cc.o
[64/362] Compiling C++ object subprojects/abseil-cpp-20240722.0/libabsl_time.a.p/absl_time_internal_cctz_src_time_zone_fixed.cc.o
[65/362] Compiling C++ object subprojects/abseil-cpp-20240722.0/libabsl_flags.a.p/absl_flags_internal_commandlineflag.cc.o
[66/362] Compiling C++ object subprojects/abseil-cpp-20240722.0/libabsl_time.a.p/absl_time_internal_cctz_src_time_zone_format.cc.o
[67/362] Compiling C++ object subprojects/abseil-cpp-20240722.0/libabsl_time.a.p/absl_time_clock.cc.o
[68/362] Compiling C++ object subprojects/abseil-cpp-20240722.0/libabsl_base.a.p/absl_base_internal_thread_identity.cc.o
[69/362] Linking static target subprojects/abseil-cpp-20240722.0/libabsl_base.a
[70/362] Compiling C++ object subprojects/abseil-cpp-20240722.0/libabsl_strings.a.p/absl_strings_internal_str_format_output.cc.o
[71/362] Compiling C++ object subprojects/abseil-cpp-20240722.0/libabsl_strings.a.p/absl_strings_match.cc.o
[72/362] Compiling C++ object subprojects/abseil-cpp-20240722.0/libabsl_crc.a.p/absl_crc_internal_crc_non_temporal_memcpy.cc.o
[73/362] Compiling C++ object subprojects/abseil-cpp-20240722.0/libabsl_container.a.p/absl_container_internal_raw_hash_set.cc.o
[74/362] Compiling C++ object subprojects/abseil-cpp-20240722.0/libabsl_time.a.p/absl_time_internal_cctz_src_civil_time_detail.cc.o
[75/362] Compiling C++ object subprojects/abseil-cpp-20240722.0/libabsl_crc.a.p/absl_crc_crc32c.cc.o
[76/362] Compiling C++ object subprojects/abseil-cpp-20240722.0/libabsl_random.a.p/absl_random_discrete_distribution.cc.o
[77/362] Compiling C++ object subprojects/abseil-cpp-20240722.0/libabsl_numeric.a.p/absl_numeric_int128.cc.o
[78/362] Compiling C++ object subprojects/abseil-cpp-20240722.0/libabsl_crc.a.p/absl_crc_internal_crc_cord_state.cc.o
[79/362] Compiling C++ object subprojects/abseil-cpp-20240722.0/libabsl_strings.a.p/absl_strings_internal_str_format_parser.cc.o
[80/362] Compiling C++ object subprojects/abseil-cpp-20240722.0/libabsl_strings.a.p/absl_strings_internal_cord_rep_btree.cc.o
[81/362] Compiling C++ object subprojects/abseil-cpp-20240722.0/libabsl_crc.a.p/absl_crc_internal_crc_memcpy_x86_arm_combined.cc.o
[82/362] Compiling C++ object subprojects/abseil-cpp-20240722.0/libabsl_random.a.p/absl_random_internal_chi_square.cc.o
[83/362] Compiling C++ object subprojects/abseil-cpp-20240722.0/libabsl_profiling.a.p/absl_profiling_internal_exponential_biased.cc.o
[84/362] Compiling C++ object subprojects/abseil-cpp-20240722.0/libabsl_strings.a.p/absl_strings_internal_cordz_sample_token.cc.o
[85/362] Linking static target subprojects/abseil-cpp-20240722.0/libabsl_profiling.a
[86/362] Compiling C++ object subprojects/abseil-cpp-20240722.0/libabsl_time.a.p/absl_time_time.cc.o
[87/362] Compiling C++ object subprojects/abseil-cpp-20240722.0/libabsl_container.a.p/absl_container_internal_hashtablez_sampler_force_weak_definition.cc.o
[88/362] Compiling C++ object subprojects/abseil-cpp-20240722.0/libabsl_strings.a.p/absl_strings_internal_str_format_float_conversion.cc.o
[89/362] Compiling C++ object subprojects/abseil-cpp-20240722.0/libabsl_time.a.p/absl_time_internal_cctz_src_time_zone_if.cc.o
[90/362] Compiling C++ object subprojects/abseil-cpp-20240722.0/libabsl_time.a.p/absl_time_internal_cctz_src_time_zone_posix.cc.o
[91/362] Compiling C++ object subprojects/abseil-cpp-20240722.0/libabsl_types.a.p/absl_types_bad_variant_access.cc.o
[92/362] Compiling C++ object subprojects/abseil-cpp-20240722.0/libabsl_synchronization.a.p/absl_synchronization_internal_futex_waiter.cc.o
[93/362] Linking static target subprojects/abseil-cpp-20240722.0/libabsl_numeric.a
[94/362] Compiling C++ object subprojects/abseil-cpp-20240722.0/libabsl_random.a.p/absl_random_internal_randen_slow.cc.o
[95/362] Compiling C++ object subprojects/abseil-cpp-20240722.0/libabsl_hash.a.p/absl_hash_internal_city.cc.o
[96/362] Compiling C++ object subprojects/abseil-cpp-20240722.0/libabsl_types.a.p/absl_types_bad_optional_access.cc.o
[97/362] Linking static target subprojects/abseil-cpp-20240722.0/libabsl_hash.a
[98/362] Linking static target subprojects/abseil-cpp-20240722.0/libabsl_types.a
[99/362] Compiling C++ object subprojects/abseil-cpp-20240722.0/libabsl_log.a.p/absl_log_internal_nullguard.cc.o
[100/362] Compiling C++ object subprojects/abseil-cpp-20240722.0/libabsl_synchronization.a.p/absl_synchronization_internal_per_thread_sem.cc.o
[101/362] Compiling C++ object subprojects/abseil-cpp-20240722.0/libabsl_strings.a.p/absl_strings_cord.cc.o
[102/362] Compiling C++ object subprojects/abseil-cpp-20240722.0/libabsl_debugging.a.p/absl_debugging_internal_examine_stack.cc.o
[103/362] Compiling C++ object subprojects/abseil-cpp-20240722.0/libabsl_crc.a.p/absl_crc_internal_crc_memcpy_fallback.cc.o
[104/362] Linking static target subprojects/abseil-cpp-20240722.0/libabsl_crc.a
[105/362] Compiling C++ object subprojects/abseil-cpp-20240722.0/libabsl_time.a.p/absl_time_internal_cctz_src_time_zone_libc.cc.o
[106/362] Compiling C++ object subprojects/abseil-cpp-20240722.0/libabsl_time.a.p/absl_time_internal_cctz_src_zone_info_source.cc.o
[107/362] Compiling C++ object subprojects/abseil-cpp-20240722.0/libabsl_log.a.p/absl_log_internal_conditions.cc.o
[108/362] Compiling C++ object subprojects/highway/libhwy.a.p/hwy_print.cc.o
In file included from ../../subprojects/highway/hwy/print.h:24,
from ../../subprojects/highway/hwy/print.cc:16:
../../subprojects/highway/hwy/base.h: In static member function ‘static uint64_t hwy::Divisor64::Div128(uint64_t, uint64_t)’:
../../subprojects/highway/hwy/base.h:3060:27: warning: ISO C++ does not support ‘__int128’ for ‘type name’ [-Wpedantic]
3060 | using u128 = unsigned __int128;
| ^~~~~~~~
../../subprojects/highway/hwy/base.h: In static member function ‘static uint64_t hwy::Divisor64::MulHigh(uint64_t, uint64_t)’:
../../subprojects/highway/hwy/base.h:3070:27: warning: ISO C++ does not support ‘__int128’ for ‘type name’ [-Wpedantic]
3070 | using u128 = unsigned __int128;
| ^~~~~~~~
[109/362] Compiling C++ object subprojects/abseil-cpp-20240722.0/libabsl_time.a.p/absl_time_internal_cctz_src_time_zone_info.cc.o
[110/362] Compiling C++ object subprojects/abseil-cpp-20240722.0/libabsl_random.a.p/absl_random_internal_seed_material.cc.o
[111/362] Compiling C++ object subprojects/abseil-cpp-20240722.0/libabsl_time.a.p/absl_time_internal_cctz_src_time_zone_lookup.cc.o
[112/362] Compiling C++ object subprojects/abseil-cpp-20240722.0/libabsl_time.a.p/absl_time_civil_time.cc.o
[113/362] Compiling C++ object subprojects/abseil-cpp-20240722.0/libabsl_synchronization.a.p/absl_synchronization_barrier.cc.o
[114/362] Compiling C++ object subprojects/abseil-cpp-20240722.0/libabsl_synchronization.a.p/absl_synchronization_internal_kernel_timeout.cc.o
[115/362] Compiling C++ object subprojects/abseil-cpp-20240722.0/libabsl_log.a.p/absl_log_internal_check_op.cc.o
[116/362] Compiling C++ object subprojects/abseil-cpp-20240722.0/libabsl_random.a.p/absl_random_seed_sequences.cc.o
[117/362] Compiling C++ object subprojects/abseil-cpp-20240722.0/libabsl_log.a.p/absl_log_initialize.cc.o
[118/362] Compiling C++ object subprojects/abseil-cpp-20240722.0/libabsl_time.a.p/absl_time_internal_cctz_src_time_zone_impl.cc.o
[119/362] Compiling C++ object subprojects/abseil-cpp-20240722.0/libabsl_log.a.p/absl_log_die_if_null.cc.o
[120/362] Compiling C++ object subprojects/highway/libhwy.a.p/hwy_abort.cc.o
In file included from ../../subprojects/highway/hwy/abort.cc:15:
../../subprojects/highway/hwy/base.h: In static member function ‘static uint64_t hwy::Divisor64::Div128(uint64_t, uint64_t)’:
../../subprojects/highway/hwy/base.h:3060:27: warning: ISO C++ does not support ‘__int128’ for ‘type name’ [-Wpedantic]
3060 | using u128 = unsigned __int128;
| ^~~~~~~~
../../subprojects/highway/hwy/base.h: In static member function ‘static uint64_t hwy::Divisor64::MulHigh(uint64_t, uint64_t)’:
../../subprojects/highway/hwy/base.h:3070:27: warning: ISO C++ does not support ‘__int128’ for ‘type name’ [-Wpedantic]
3070 | using u128 = unsigned __int128;
| ^~~~~~~~
[121/362] Compiling C++ object subprojects/abseil-cpp-20240722.0/libabsl_debugging.a.p/absl_debugging_symbolize.cc.o
[122/362] Linking static target subprojects/abseil-cpp-20240722.0/libabsl_debugging.a
[123/362] Compiling C++ object subprojects/highway/libhwy_contrib.a.p/hwy_contrib_image_image.cc.o
In file included from ../../subprojects/highway/hwy/aligned_allocator.h:32,
from ../../subprojects/highway/hwy/contrib/image/image.h:25,
from ../../subprojects/highway/hwy/contrib/image/image.cc:16:
../../subprojects/highway/hwy/base.h: In static member function ‘static uint64_t hwy::Divisor64::Div128(uint64_t, uint64_t)’:
../../subprojects/highway/hwy/base.h:3060:27: warning: ISO C++ does not support ‘__int128’ for ‘type name’ [-Wpedantic]
3060 | using u128 = unsigned __int128;
| ^~~~~~~~
../../subprojects/highway/hwy/base.h: In static member function ‘static uint64_t hwy::Divisor64::MulHigh(uint64_t, uint64_t)’:
../../subprojects/highway/hwy/base.h:3070:27: warning: ISO C++ does not support ‘__int128’ for ‘type name’ [-Wpedantic]
3070 | using u128 = unsigned __int128;
| ^~~~~~~~
[124/362] Compiling C++ object subprojects/abseil-cpp-20240722.0/libabsl_log.a.p/absl_log_globals.cc.o
[125/362] Compiling C++ object subprojects/abseil-cpp-20240722.0/libabsl_random.a.p/absl_random_internal_pool_urbg.cc.o
[126/362] Compiling C++ object subprojects/highway/libhwy.a.p/hwy_nanobenchmark.cc.o
../../subprojects/highway/hwy/nanobenchmark.cc:81:43: warning: ISO C++11 requires at least one argument for the "..." in a variadic macro
81 | HWY_WARN("estimated duration is 0\n");
| ^
In file included from ../../subprojects/highway/hwy/timer.h:25,
from ../../subprojects/highway/hwy/nanobenchmark.h:52,
from ../../subprojects/highway/hwy/nanobenchmark.cc:16:
../../subprojects/highway/hwy/base.h: In static member function ‘static uint64_t hwy::Divisor64::Div128(uint64_t, uint64_t)’:
../../subprojects/highway/hwy/base.h:3060:27: warning: ISO C++ does not support ‘__int128’ for ‘type name’ [-Wpedantic]
3060 | using u128 = unsigned __int128;
| ^~~~~~~~
../../subprojects/highway/hwy/base.h: In static member function ‘static uint64_t hwy::Divisor64::MulHigh(uint64_t, uint64_t)’:
../../subprojects/highway/hwy/base.h:3070:27: warning: ISO C++ does not support ‘__int128’ for ‘type name’ [-Wpedantic]
3070 | using u128 = unsigned __int128;
| ^~~~~~~~
[127/362] Compiling C++ object subprojects/abseil-cpp-20240722.0/libabsl_strings.a.p/absl_strings_internal_str_format_bind.cc.o
[128/362] Compiling C++ object subprojects/abseil-cpp-20240722.0/libabsl_flags.a.p/absl_flags_internal_private_handle_accessor.cc.o
[129/362] Compiling C++ object subprojects/highway/libhwy.a.p/hwy_perf_counters.cc.o
../../subprojects/highway/hwy/perf_counters.cc:146:58: warning: ISO C++11 requires at least one argument for the "..." in a variadic macro
146 | HWY_WARN("perf_event_open retries were insufficient.");
| ^
../../subprojects/highway/hwy/perf_counters.cc:219:53: warning: ISO C++11 requires at least one argument for the "..." in a variadic macro
219 | "continue, but counters will return zero.");
| ^
../../subprojects/highway/hwy/perf_counters.cc:292:42: warning: ISO C++11 requires at least one argument for the "..." in a variadic macro
292 | HWY_WARN("No valid counters found.");
| ^
In file included from ../../subprojects/highway/hwy/perf_counters.h:23,
from ../../subprojects/highway/hwy/perf_counters.cc:16:
../../subprojects/highway/hwy/base.h: In static member function ‘static uint64_t hwy::Divisor64::Div128(uint64_t, uint64_t)’:
../../subprojects/highway/hwy/base.h:3060:27: warning: ISO C++ does not support ‘__int128’ for ‘type name’ [-Wpedantic]
3060 | using u128 = unsigned __int128;
| ^~~~~~~~
../../subprojects/highway/hwy/base.h: In static member function ‘static uint64_t hwy::Divisor64::MulHigh(uint64_t, uint64_t)’:
../../subprojects/highway/hwy/base.h:3070:27: warning: ISO C++ does not support ‘__int128’ for ‘type name’ [-Wpedantic]
3070 | using u128 = unsigned __int128;
| ^~~~~~~~
[130/362] Compiling C++ object subprojects/abseil-cpp-20240722.0/libabsl_synchronization.a.p/absl_synchronization_internal_stdcpp_waiter.cc.o
[131/362] Compiling C++ object subprojects/abseil-cpp-20240722.0/libabsl_synchronization.a.p/absl_synchronization_blocking_counter.cc.o
[132/362] Compiling C++ object subprojects/abseil-cpp-20240722.0/libabsl_time.a.p/absl_time_duration.cc.o
[133/362] Compiling C++ object subprojects/abseil-cpp-20240722.0/libabsl_log.a.p/absl_log_internal_fnmatch.cc.o
[134/362] Compiling C++ object subprojects/abseil-cpp-20240722.0/libabsl_log.a.p/absl_log_log_entry.cc.o
[135/362] Compiling C++ object subprojects/abseil-cpp-20240722.0/libabsl_strings.a.p/absl_strings_str_replace.cc.o
[136/362] Compiling C++ object subprojects/abseil-cpp-20240722.0/libabsl_status.a.p/absl_status_status.cc.o
[137/362] Compiling C++ object subprojects/abseil-cpp-20240722.0/libabsl_synchronization.a.p/absl_synchronization_internal_pthread_waiter.cc.o
[138/362] Compiling C++ object subprojects/highway/libhwy.a.p/hwy_profiler.cc.o
In file included from ../../subprojects/highway/hwy/profiler.h:25,
from ../../subprojects/highway/hwy/profiler.cc:16:
../../subprojects/highway/hwy/base.h: In static member function ‘static uint64_t hwy::Divisor64::Div128(uint64_t, uint64_t)’:
../../subprojects/highway/hwy/base.h:3060:27: warning: ISO C++ does not support ‘__int128’ for ‘type name’ [-Wpedantic]
3060 | using u128 = unsigned __int128;
| ^~~~~~~~
../../subprojects/highway/hwy/base.h: In static member function ‘static uint64_t hwy::Divisor64::MulHigh(uint64_t, uint64_t)’:
../../subprojects/highway/hwy/base.h:3070:27: warning: ISO C++ does not support ‘__int128’ for ‘type name’ [-Wpedantic]
3070 | using u128 = unsigned __int128;
| ^~~~~~~~
[139/362] Compiling C++ object subprojects/abseil-cpp-20240722.0/libabsl_log.a.p/absl_log_internal_vlog_config.cc.o
[140/362] Compiling C++ object subprojects/highway/libhwy.a.p/hwy_aligned_allocator.cc.o
In file included from ../../subprojects/highway/hwy/aligned_allocator.h:32,
from ../../subprojects/highway/hwy/aligned_allocator.cc:16:
../../subprojects/highway/hwy/base.h: In static member function ‘static uint64_t hwy::Divisor64::Div128(uint64_t, uint64_t)’:
../../subprojects/highway/hwy/base.h:3060:27: warning: ISO C++ does not support ‘__int128’ for ‘type name’ [-Wpedantic]
3060 | using u128 = unsigned __int128;
| ^~~~~~~~
../../subprojects/highway/hwy/base.h: In static member function ‘static uint64_t hwy::Divisor64::MulHigh(uint64_t, uint64_t)’:
../../subprojects/highway/hwy/base.h:3070:27: warning: ISO C++ does not support ‘__int128’ for ‘type name’ [-Wpedantic]
3070 | using u128 = unsigned __int128;
| ^~~~~~~~
[141/362] Compiling C++ object subprojects/abseil-cpp-20240722.0/libabsl_flags.a.p/absl_flags_marshalling.cc.o
[142/362] Compiling C++ object subprojects/abseil-cpp-20240722.0/libabsl_strings.a.p/absl_strings_numbers.cc.o
[143/362] Generating 'lc0.p/proto/onnx.pb.h'
[144/362] Compiling C++ object subprojects/abseil-cpp-20240722.0/libabsl_container.a.p/absl_container_internal_hashtablez_sampler.cc.o
[145/362] Linking static target subprojects/abseil-cpp-20240722.0/libabsl_container.a
[146/362] Compiling C++ object subprojects/highway/libhwy_contrib.a.p/hwy_contrib_thread_pool_topology.cc.o
../../subprojects/highway/hwy/contrib/thread_pool/topology.cc:970:66: warning: ISO C++11 requires at least one argument for the "..." in a variadic macro
970 | HWY_WARN("no packages, shared cache sizes may be incorrect\n");
| ^
In file included from ../../subprojects/highway/hwy/contrib/thread_pool/topology.h:25,
from ../../subprojects/highway/hwy/contrib/thread_pool/topology.cc:16:
../../subprojects/highway/hwy/base.h: In static member function ‘static uint64_t hwy::Divisor64::Div128(uint64_t, uint64_t)’:
../../subprojects/highway/hwy/base.h:3060:27: warning: ISO C++ does not support ‘__int128’ for ‘type name’ [-Wpedantic]
3060 | using u128 = unsigned __int128;
| ^~~~~~~~
../../subprojects/highway/hwy/base.h: In static member function ‘static uint64_t hwy::Divisor64::MulHigh(uint64_t, uint64_t)’:
../../subprojects/highway/hwy/base.h:3070:27: warning: ISO C++ does not support ‘__int128’ for ‘type name’ [-Wpedantic]
3070 | using u128 = unsigned __int128;
| ^~~~~~~~
[147/362] Generating 'lc0.p/proto/hlo.pb.h'
[148/362] Compiling C++ object subprojects/abseil-cpp-20240722.0/libabsl_status.a.p/absl_status_statusor.cc.o
[149/362] Generating 'lc0.p/proto/net.pb.h'
[150/362] Generating 'encoder_test.p/proto/net.pb.h'
[151/362] Compiling C++ object subprojects/abseil-cpp-20240722.0/libabsl_strings.a.p/absl_strings_internal_cord_rep_crc.cc.o
[152/362] Generating 'liblc0_lib.so.p/proto/net.pb.h'
[153/362] Compiling C++ object subprojects/abseil-cpp-20240722.0/libabsl_random.a.p/absl_random_internal_randen_hwaes.cc.o
[154/362] Generating 'engine_test.p/proto/net.pb.h'
[155/362] Linking static target subprojects/abseil-cpp-20240722.0/libabsl_random.a
[156/362] Compiling C++ object subprojects/abseil-cpp-20240722.0/libabsl_log.a.p/absl_log_flags.cc.o
[157/362] Linking static target subprojects/abseil-cpp-20240722.0/libabsl_strings.a
[158/362] Compiling C++ object subprojects/abseil-cpp-20240722.0/libabsl_synchronization.a.p/absl_synchronization_internal_sem_waiter.cc.o
[159/362] Compiling C++ object subprojects/abseil-cpp-20240722.0/libabsl_time.a.p/absl_time_format.cc.o
[160/362] Compiling C++ object subprojects/abseil-cpp-20240722.0/libabsl_flags.a.p/absl_flags_internal_flag.cc.o
[161/362] Compiling C++ object subprojects/abseil-cpp-20240722.0/libabsl_flags.a.p/absl_flags_internal_program_name.cc.o
[162/362] Compiling C++ object subprojects/abseil-cpp-20240722.0/libabsl_log.a.p/absl_log_internal_globals.cc.o
[163/362] Compiling C++ object subprojects/abseil-cpp-20240722.0/libabsl_log.a.p/absl_log_internal_proto.cc.o
[164/362] Linking static target subprojects/abseil-cpp-20240722.0/libabsl_time.a
[165/362] Compiling C++ object subprojects/abseil-cpp-20240722.0/libabsl_log.a.p/absl_log_log_sink.cc.o
[166/362] Compiling C++ object subprojects/highway/libhwy.a.p/hwy_timer.cc.o
../../subprojects/highway/hwy/timer.cc:39:71: warning: ISO C++11 requires at least one argument for the "..." in a variadic macro
39 | HWY_WARN("TSC not constant/invariant, may vary frequency or jump.");
| ^
In file included from ../../subprojects/highway/hwy/timer.h:25,
from ../../subprojects/highway/hwy/timer.cc:16:
../../subprojects/highway/hwy/base.h: In static member function ‘static uint64_t hwy::Divisor64::Div128(uint64_t, uint64_t)’:
../../subprojects/highway/hwy/base.h:3060:27: warning: ISO C++ does not support ‘__int128’ for ‘type name’ [-Wpedantic]
3060 | using u128 = unsigned __int128;
| ^~~~~~~~
../../subprojects/highway/hwy/base.h: In static member function ‘static uint64_t hwy::Divisor64::MulHigh(uint64_t, uint64_t)’:
../../subprojects/highway/hwy/base.h:3070:27: warning: ISO C++ does not support ‘__int128’ for ‘type name’ [-Wpedantic]
3070 | using u128 = unsigned __int128;
| ^~~~~~~~
[167/362] Compiling C++ object subprojects/abseil-cpp-20240722.0/libabsl_flags.a.p/absl_flags_commandlineflag.cc.o
[168/362] Compiling C++ object subprojects/abseil-cpp-20240722.0/libabsl_synchronization.a.p/absl_synchronization_notification.cc.o
[169/362] Compiling C++ object subprojects/abseil-cpp-20240722.0/libabsl_log.a.p/absl_log_internal_log_sink_set.cc.o
[170/362] Compiling C++ object subprojects/highway/libhwy_contrib.a.p/hwy_contrib_thread_pool_thread_pool.cc.o
In file included from ../../subprojects/highway/hwy/contrib/thread_pool/thread_pool.h:39,
from ../../subprojects/highway/hwy/contrib/thread_pool/thread_pool.cc:16:
../../subprojects/highway/hwy/contrib/thread_pool/spin.h:308:78: warning: ISO C++11 requires at least one argument for the "..." in a variadic macro
308 | HWY_WARN("Ignoring attempt to disable Pause, it is the only option left.");
| ^
In file included from ../../subprojects/highway/hwy/aligned_allocator.h:32,
from ../../subprojects/highway/hwy/contrib/thread_pool/thread_pool.h:34,
from ../../subprojects/highway/hwy/contrib/thread_pool/thread_pool.cc:16:
../../subprojects/highway/hwy/base.h: In static member function ‘static uint64_t hwy::Divisor64::Div128(uint64_t, uint64_t)’:
../../subprojects/highway/hwy/base.h:3060:27: warning: ISO C++ does not support ‘__int128’ for ‘type name’ [-Wpedantic]
3060 | using u128 = unsigned __int128;
| ^~~~~~~~
../../subprojects/highway/hwy/base.h: In static member function ‘static uint64_t hwy::Divisor64::MulHigh(uint64_t, uint64_t)’:
../../subprojects/highway/hwy/base.h:3070:27: warning: ISO C++ does not support ‘__int128’ for ‘type name’ [-Wpedantic]
3070 | using u128 = unsigned __int128;
| ^~~~~~~~
[171/362] Compiling C++ object subprojects/abseil-cpp-20240722.0/libabsl_flags.a.p/absl_flags_usage.cc.o
[172/362] Compiling C++ object subprojects/abseil-cpp-20240722.0/libabsl_synchronization.a.p/absl_synchronization_internal_waiter_base.cc.o
[173/362] Compiling C++ object subprojects/abseil-cpp-20240722.0/libabsl_synchronization.a.p/absl_synchronization_internal_graphcycles.cc.o
[174/362] Compiling C++ object subprojects/highway/libhwy_contrib.a.p/hwy_contrib_sort_vqsort.cc.o
In file included from ../../subprojects/highway/hwy/contrib/sort/vqsort.h:33,
from ../../subprojects/highway/hwy/contrib/sort/vqsort.cc:16:
../../subprojects/highway/hwy/base.h: In static member function ‘static uint64_t hwy::Divisor64::Div128(uint64_t, uint64_t)’:
../../subprojects/highway/hwy/base.h:3060:27: warning: ISO C++ does not support ‘__int128’ for ‘type name’ [-Wpedantic]
3060 | using u128 = unsigned __int128;
| ^~~~~~~~
../../subprojects/highway/hwy/base.h: In static member function ‘static uint64_t hwy::Divisor64::MulHigh(uint64_t, uint64_t)’:
../../subprojects/highway/hwy/base.h:3070:27: warning: ISO C++ does not support ‘__int128’ for ‘type name’ [-Wpedantic]
3070 | using u128 = unsigned __int128;
| ^~~~~~~~
[175/362] Compiling C++ object subprojects/abseil-cpp-20240722.0/libabsl_log.a.p/absl_log_internal_log_format.cc.o
[176/362] Compiling C++ object subprojects/abseil-cpp-20240722.0/libabsl_flags.a.p/absl_flags_usage_config.cc.o
[177/362] Compiling C++ object subprojects/highway/libhwy.a.p/hwy_targets.cc.o
In file included from ../../subprojects/highway/hwy/targets.h:28,
from ../../subprojects/highway/hwy/targets.cc:17:
../../subprojects/highway/hwy/base.h: In static member function ‘static uint64_t hwy::Divisor64::Div128(uint64_t, uint64_t)’:
../../subprojects/highway/hwy/base.h:3060:27: warning: ISO C++ does not support ‘__int128’ for ‘type name’ [-Wpedantic]
3060 | using u128 = unsigned __int128;
| ^~~~~~~~
../../subprojects/highway/hwy/base.h: In static member function ‘static uint64_t hwy::Divisor64::MulHigh(uint64_t, uint64_t)’:
../../subprojects/highway/hwy/base.h:3070:27: warning: ISO C++ does not support ‘__int128’ for ‘type name’ [-Wpedantic]
3070 | using u128 = unsigned __int128;
| ^~~~~~~~
[178/362] Compiling C++ object subprojects/abseil-cpp-20240722.0/libabsl_flags.a.p/absl_flags_internal_usage.cc.o
[179/362] Compiling C++ object subprojects/abseil-cpp-20240722.0/libabsl_synchronization.a.p/absl_synchronization_internal_create_thread_identity.cc.o
[180/362] Compiling C++ object subprojects/abseil-cpp-20240722.0/libabsl_synchronization.a.p/absl_synchronization_mutex.cc.o
[181/362] Linking static target subprojects/abseil-cpp-20240722.0/libabsl_synchronization.a
[182/362] Compiling C++ object subprojects/abseil-cpp-20240722.0/libabsl_status.a.p/absl_status_status_payload_printer.cc.o
[183/362] Compiling C++ object subprojects/abseil-cpp-20240722.0/libabsl_log.a.p/absl_log_internal_log_message.cc.o
[184/362] Linking static target subprojects/abseil-cpp-20240722.0/libabsl_log.a
[185/362] Compiling C++ object lc0.p/src_chess_gamestate.cc.o
[186/362] Compiling C++ object subprojects/abseil-cpp-20240722.0/libabsl_status.a.p/absl_status_internal_status_internal.cc.o
[187/362] Linking static target subprojects/abseil-cpp-20240722.0/libabsl_status.a
[188/362] Compiling C++ object subprojects/abseil-cpp-20240722.0/libabsl_flags.a.p/absl_flags_parse.cc.o
[189/362] Compiling C++ object lc0.p/src_search_classic_stoppers_smooth.cc.o
[190/362] Compiling C++ object subprojects/abseil-cpp-20240722.0/libabsl_flags.a.p/absl_flags_reflection.cc.o
[191/362] Linking static target subprojects/abseil-cpp-20240722.0/libabsl_flags.a
[192/362] Compiling C++ object lc0.p/src_neural_xla_print_hlo.cc.o
[193/362] Compiling C++ object lc0.p/src_search_classic_stoppers_factory.cc.o
[194/362] Compiling C++ object lc0.p/src_neural_backends_network_check.cc.o
[195/362] Compiling C++ object lc0.p/src_search_register.cc.o
[196/362] Compiling C++ object lc0.p/src_search_classic_stoppers_timemgr.cc.o
[197/362] Compiling C++ object lc0.p/src_neural_network_legacy.cc.o
[198/362] Compiling C++ object lc0.p/src_tools_benchmark.cc.o
[199/362] Compiling C++ object lc0.p/src_neural_backends_network_random.cc.o
[200/362] Compiling C++ object lc0.p/src_chess_board.cc.o
[201/362] Compiling C++ object lc0.p/src_search_classic_stoppers_stoppers.cc.o
[202/362] Compiling C++ object lc0.p/src_neural_backends_network_mux.cc.o
[203/362] Compiling C++ object lc0.p/src_neural_xla_xla_tensor.cc.o
[204/362] Compiling C++ object lc0.p/src_neural_onnx_builder.cc.o
[205/362] Compiling C++ object lc0.p/src_neural_backends_blas_se_unit.cc.o
[206/362] Compiling C++ object lc0.p/src_neural_backends_network_demux.cc.o
[207/362] Compiling C++ object lc0.p/src_search_classic_stoppers_legacy.cc.o
[208/362] Compiling C++ object lc0.p/src_search_classic_stoppers_alphazero.cc.o
[209/362] Compiling C++ object lc0.p/src_neural_backends_shared_winograd_filter.cc.o
[210/362] Compiling C++ object lc0.p/src_utils_histogram.cc.o
[211/362] Compiling C++ object lc0.p/src_neural_onnx_adapters.cc.o
[212/362] Compiling C++ object lc0.p/src_search_classic_stoppers_common.cc.o
[213/362] Compiling C++ object lc0.p/src_search_classic_search.cc.o
[214/362] Compiling C++ object lc0.p/src_neural_backends_network_trivial.cc.o
[215/362] Compiling C++ object lc0.p/src_utils_numa.cc.o
../../src/utils/numa.cc: In static member function ‘static void lczero::Numa::BindThreadToNode(int)’:
../../src/utils/numa.cc:761:33: warning: unused parameter ‘node_id’ [-Wunused-parameter]
761 | void Numa::BindThreadToNode(int node_id) {
| ~~~~^~~~~~~
../../src/utils/numa.cc: In static member function ‘static void lczero::Numa::BindThreadToCudaDevice(int)’:
../../src/utils/numa.cc:776:39: warning: unused parameter ‘device_id’ [-Wunused-parameter]
776 | void Numa::BindThreadToCudaDevice(int device_id) {
| ~~~~^~~~~~~~~
[216/362] Compiling C++ object lc0.p/src_neural_backends_network_rr.cc.o
[217/362] Compiling C++ object lc0.p/src_search_classic_wrapper.cc.o
[218/362] Compiling C++ object lc0.p/src_search_classic_stoppers_simple.cc.o
[219/362] Compiling C++ object lc0.p/src_neural_onnx_converter.cc.o
[220/362] Compiling C++ object lc0.p/src_chess_position.cc.o
[221/362] Compiling C++ object lc0.p/src_engine.cc.o
[222/362] Compiling C++ object lc0.p/src_engine_loop.cc.o
[223/362] Compiling C++ object lc0.p/src_neural_xla_hlo_builder.cc.o
[224/362] Compiling C++ object lc0.p/src_main.cc.o
[225/362] Compiling C++ object subprojects/highway/libhwy.a.p/hwy_per_target.cc.o
In file included from ../../subprojects/highway/hwy/highway.h:19,
from ../../subprojects/highway/hwy/per_target.cc:28,
from ../../subprojects/highway/hwy/foreach_target.h:72,
from ../../subprojects/highway/hwy/per_target.cc:27:
../../subprojects/highway/hwy/base.h: In static member function ‘static uint64_t hwy::Divisor64::Div128(uint64_t, uint64_t)’:
../../subprojects/highway/hwy/base.h:3060:27: warning: ISO C++ does not support ‘__int128’ for ‘type name’ [-Wpedantic]
3060 | using u128 = unsigned __int128;
| ^~~~~~~~
../../subprojects/highway/hwy/base.h: In static member function ‘static uint64_t hwy::Divisor64::MulHigh(uint64_t, uint64_t)’:
../../subprojects/highway/hwy/base.h:3070:27: warning: ISO C++ does not support ‘__int128’ for ‘type name’ [-Wpedantic]
3070 | using u128 = unsigned __int128;
| ^~~~~~~~
[226/362] Linking static target subprojects/highway/libhwy.a
[227/362] Compiling C++ object lc0.p/src_neural_memcache.cc.o
[228/362] Compiling C++ object lc0.p/src_search_classic_params.cc.o
[229/362] Compiling C++ object lc0.p/src_neural_backends_shared_activation.cc.o
[230/362] Compiling C++ object lc0.p/src_neural_backends_network_record.cc.o
[231/362] Compiling C++ object lc0.p/src_selfplay_loop.cc.o
[232/362] Compiling C++ object lc0.p/src_utils_esc_codes.cc.o
[233/362] Compiling C++ object subprojects/highway/libhwy_contrib.a.p/hwy_contrib_sort_vqsort_f32a.cc.o
In file included from ../../subprojects/highway/hwy/contrib/sort/vqsort.h:33,
from ../../subprojects/highway/hwy/contrib/sort/vqsort_f32a.cc:16:
../../subprojects/highway/hwy/base.h: In static member function ‘static uint64_t hwy::Divisor64::Div128(uint64_t, uint64_t)’:
../../subprojects/highway/hwy/base.h:3060:27: warning: ISO C++ does not support ‘__int128’ for ‘type name’ [-Wpedantic]
3060 | using u128 = unsigned __int128;
| ^~~~~~~~
../../subprojects/highway/hwy/base.h: In static member function ‘static uint64_t hwy::Divisor64::MulHigh(uint64_t, uint64_t)’:
../../subprojects/highway/hwy/base.h:3070:27: warning: ISO C++ does not support ‘__int128’ for ‘type name’ [-Wpedantic]
3070 | using u128 = unsigned __int128;
| ^~~~~~~~
[234/362] Compiling C++ object lc0.p/src_neural_backends_blas_fully_connected_layer.cc.o
[235/362] Compiling C++ object lc0.p/src_utils_protomessage.cc.o
[236/362] Compiling C++ object lc0.p/src_utils_weights_adapter.cc.o
[237/362] Compiling C++ object lc0.p/src_neural_backends_blas_winograd_convolution3.cc.o
[238/362] Compiling C++ object lc0.p/src_neural_backends_blas_convolution1.cc.o
[239/362] Compiling C++ object lc0.p/src_selfplay_game.cc.o
[240/362] Compiling C++ object lc0.p/src_tools_describenet.cc.o
[241/362] Compiling C++ object lc0.p/src_utils_trace.cc.o
[242/362] Compiling C++ object lc0.p/src_tools_onnx2leela.cc.o
[243/362] Compiling C++ object lc0.p/src_version.cc.o
[244/362] Compiling C++ object subprojects/highway/libhwy_contrib.a.p/hwy_contrib_sort_vqsort_128d.cc.o
In file included from ../../subprojects/highway/hwy/contrib/sort/vqsort.h:33,
from ../../subprojects/highway/hwy/contrib/sort/vqsort_128d.cc:16:
../../subprojects/highway/hwy/base.h: In static member function ‘static uint64_t hwy::Divisor64::Div128(uint64_t, uint64_t)’:
../../subprojects/highway/hwy/base.h:3060:27: warning: ISO C++ does not support ‘__int128’ for ‘type name’ [-Wpedantic]
3060 | using u128 = unsigned __int128;
| ^~~~~~~~
../../subprojects/highway/hwy/base.h: In static member function ‘static uint64_t hwy::Divisor64::MulHigh(uint64_t, uint64_t)’:
../../subprojects/highway/hwy/base.h:3070:27: warning: ISO C++ does not support ‘__int128’ for ‘type name’ [-Wpedantic]
3070 | using u128 = unsigned __int128;
| ^~~~~~~~
[245/362] Compiling C++ object lc0.p/src_search_instamove_instamove.cc.o
[246/362] Compiling C++ object lc0.p/src_neural_xla_onnx2hlo.cc.o
[247/362] Compiling C++ object lc0.p/src_search_dag_classic_params.cc.o
[248/362] Compiling C++ object subprojects/highway/libhwy_contrib.a.p/hwy_contrib_sort_vqsort_i32a.cc.o
In file included from ../../subprojects/highway/hwy/contrib/sort/vqsort.h:33,
from ../../subprojects/highway/hwy/contrib/sort/vqsort_i32a.cc:16:
../../subprojects/highway/hwy/base.h: In static member function ‘static uint64_t hwy::Divisor64::Div128(uint64_t, uint64_t)’:
../../subprojects/highway/hwy/base.h:3060:27: warning: ISO C++ does not support ‘__int128’ for ‘type name’ [-Wpedantic]
3060 | using u128 = unsigned __int128;
| ^~~~~~~~
../../subprojects/highway/hwy/base.h: In static member function ‘static uint64_t hwy::Divisor64::MulHigh(uint64_t, uint64_t)’:
../../subprojects/highway/hwy/base.h:3070:27: warning: ISO C++ does not support ‘__int128’ for ‘type name’ [-Wpedantic]
3070 | using u128 = unsigned __int128;
| ^~~~~~~~
[249/362] Compiling C++ object lc0.p/src_selfplay_tournament.cc.o
[250/362] Compiling C++ object lc0.p/src_chess_uciloop.cc.o
[251/362] Compiling C++ object lc0.p/src_utils_string.cc.o
[252/362] Compiling C++ object lc0.p/src_selfplay_multigame.cc.o
[253/362] Compiling C++ object lc0.p/src_neural_backend.cc.o
[254/362] Compiling C++ object lc0.p/src_neural_backends_cuda_layers.cc.o
[255/362] Compiling C++ object lc0.p/src_syzygy_syzygy.cc.o
[256/362] Compiling C++ object lc0.p/src_tools_backendbench.cc.o
[257/362] Compiling C++ object lc0.p/src_utils_configfile.cc.o
[258/362] Compiling C++ object liblc0_lib.so.p/src_chess_position.cc.o
[259/362] Compiling C++ object liblc0_lib.so.p/src_chess_gamestate.cc.o
[260/362] Compiling C++ object liblc0_lib.so.p/src_chess_board.cc.o
[261/362] Compiling C++ object subprojects/highway/libhwy_contrib.a.p/hwy_contrib_sort_vqsort_f16a.cc.o
In file included from ../../subprojects/highway/hwy/contrib/sort/vqsort.h:33,
from ../../subprojects/highway/hwy/contrib/sort/vqsort_f16a.cc:16:
../../subprojects/highway/hwy/base.h: In static member function ‘static uint64_t hwy::Divisor64::Div128(uint64_t, uint64_t)’:
../../subprojects/highway/hwy/base.h:3060:27: warning: ISO C++ does not support ‘__int128’ for ‘type name’ [-Wpedantic]
3060 | using u128 = unsigned __int128;
| ^~~~~~~~
../../subprojects/highway/hwy/base.h: In static member function ‘static uint64_t hwy::Divisor64::MulHigh(uint64_t, uint64_t)’:
../../subprojects/highway/hwy/base.h:3070:27: warning: ISO C++ does not support ‘__int128’ for ‘type name’ [-Wpedantic]
3070 | using u128 = unsigned __int128;
| ^~~~~~~~
[262/362] Compiling C++ object lc0.p/src_neural_decoder.cc.o
[263/362] Compiling C++ object liblc0_lib.so.p/src_utils_esc_codes.cc.o
[264/362] Compiling C++ object lc0.p/src_neural_batchsplit.cc.o
[265/362] Compiling C++ object lc0.p/src_neural_encoder.cc.o
[266/362] Compiling C++ object lc0.p/src_tools_leela2onnx.cc.o
[267/362] Compiling C++ object lc0.p/src_neural_register.cc.o
[268/362] Compiling C++ object lc0.p/src_utils_files.cc.o
[269/362] Compiling C++ object lc0.p/src_utils_commandline.cc.o
[270/362] Compiling C++ object subprojects/highway/libhwy_contrib.a.p/hwy_contrib_sort_vqsort_i16d.cc.o
FAILED: subprojects/highway/libhwy_contrib.a.p/hwy_contrib_sort_vqsort_i16d.cc.o
c++ -Isubprojects/highway/libhwy_contrib.a.p -Isubprojects/highway -I../../subprojects/highway -fvisibility=hidden -fvisibility-inlines-hidden -flto=auto -fdiagnostics-color=always -DNDEBUG -D_FILE_OFFSET_BITS=64 -Wall -Winvalid-pch -Wextra -Wpedantic -fno-exceptions -fno-rtti -std=c++17 -O3 -Wno-builtin-macro-redefined '-D__DATE__="redacted"' '-D__TIMESTAMP__="redacted"' '-D__TIME__="redacted"' -fmerge-all-constants -fmath-errno -DTOOLCHAIN_MISS_ASM_HWCAP_H -Wno-psabi -fPIC -pthread -DHWY_STATIC_DEFINE -MD -MQ subprojects/highway/libhwy_contrib.a.p/hwy_contrib_sort_vqsort_i16d.cc.o -MF subprojects/highway/libhwy_contrib.a.p/hwy_contrib_sort_vqsort_i16d.cc.o.d -o subprojects/highway/libhwy_contrib.a.p/hwy_contrib_sort_vqsort_i16d.cc.o -c ../../subprojects/highway/hwy/contrib/sort/vqsort_i16d.cc
In file included from ../../subprojects/highway/hwy/contrib/sort/vqsort.h:33,
from ../../subprojects/highway/hwy/contrib/sort/vqsort_i16d.cc:16:
../../subprojects/highway/hwy/base.h: In static member function ‘static uint64_t hwy::Divisor64::Div128(uint64_t, uint64_t)’:
../../subprojects/highway/hwy/base.h:3060:27: warning: ISO C++ does not support ‘__int128’ for ‘type name’ [-Wpedantic]
3060 | using u128 = unsigned __int128;
| ^~~~~~~~
../../subprojects/highway/hwy/base.h: In static member function ‘static uint64_t hwy::Divisor64::MulHigh(uint64_t, uint64_t)’:
../../subprojects/highway/hwy/base.h:3070:27: warning: ISO C++ does not support ‘__int128’ for ‘type name’ [-Wpedantic]
3070 | using u128 = unsigned __int128;
| ^~~~~~~~
c++: fatal error: Killed signal terminated program cc1plus
compilation terminated.
[271/362] Compiling C++ object subprojects/highway/libhwy_contrib.a.p/hwy_contrib_sort_vqsort_f64d.cc.o
FAILED: subprojects/highway/libhwy_contrib.a.p/hwy_contrib_sort_vqsort_f64d.cc.o
c++ -Isubprojects/highway/libhwy_contrib.a.p -Isubprojects/highway -I../../subprojects/highway -fvisibility=hidden -fvisibility-inlines-hidden -flto=auto -fdiagnostics-color=always -DNDEBUG -D_FILE_OFFSET_BITS=64 -Wall -Winvalid-pch -Wextra -Wpedantic -fno-exceptions -fno-rtti -std=c++17 -O3 -Wno-builtin-macro-redefined '-D__DATE__="redacted"' '-D__TIMESTAMP__="redacted"' '-D__TIME__="redacted"' -fmerge-all-constants -fmath-errno -DTOOLCHAIN_MISS_ASM_HWCAP_H -Wno-psabi -fPIC -pthread -DHWY_STATIC_DEFINE -MD -MQ subprojects/highway/libhwy_contrib.a.p/hwy_contrib_sort_vqsort_f64d.cc.o -MF subprojects/highway/libhwy_contrib.a.p/hwy_contrib_sort_vqsort_f64d.cc.o.d -o subprojects/highway/libhwy_contrib.a.p/hwy_contrib_sort_vqsort_f64d.cc.o -c ../../subprojects/highway/hwy/contrib/sort/vqsort_f64d.cc
In file included from ../../subprojects/highway/hwy/contrib/sort/vqsort.h:33,
from ../../subprojects/highway/hwy/contrib/sort/vqsort_f64d.cc:16:
../../subprojects/highway/hwy/base.h: In static member function ‘static uint64_t hwy::Divisor64::Div128(uint64_t, uint64_t)’:
../../subprojects/highway/hwy/base.h:3060:27: warning: ISO C++ does not support ‘__int128’ for ‘type name’ [-Wpedantic]
3060 | using u128 = unsigned __int128;
| ^~~~~~~~
../../subprojects/highway/hwy/base.h: In static member function ‘static uint64_t hwy::Divisor64::MulHigh(uint64_t, uint64_t)’:
../../subprojects/highway/hwy/base.h:3070:27: warning: ISO C++ does not support ‘__int128’ for ‘type name’ [-Wpedantic]
3070 | using u128 = unsigned __int128;
| ^~~~~~~~
c++: fatal error: Killed signal terminated program cc1plus
compilation terminated.
[272/362] Compiling C++ object subprojects/highway/libhwy_contrib.a.p/hwy_contrib_sort_vqsort_i16a.cc.o
FAILED: subprojects/highway/libhwy_contrib.a.p/hwy_contrib_sort_vqsort_i16a.cc.o
c++ -Isubprojects/highway/libhwy_contrib.a.p -Isubprojects/highway -I../../subprojects/highway -fvisibility=hidden -fvisibility-inlines-hidden -flto=auto -fdiagnostics-color=always -DNDEBUG -D_FILE_OFFSET_BITS=64 -Wall -Winvalid-pch -Wextra -Wpedantic -fno-exceptions -fno-rtti -std=c++17 -O3 -Wno-builtin-macro-redefined '-D__DATE__="redacted"' '-D__TIMESTAMP__="redacted"' '-D__TIME__="redacted"' -fmerge-all-constants -fmath-errno -DTOOLCHAIN_MISS_ASM_HWCAP_H -Wno-psabi -fPIC -pthread -DHWY_STATIC_DEFINE -MD -MQ subprojects/highway/libhwy_contrib.a.p/hwy_contrib_sort_vqsort_i16a.cc.o -MF subprojects/highway/libhwy_contrib.a.p/hwy_contrib_sort_vqsort_i16a.cc.o.d -o subprojects/highway/libhwy_contrib.a.p/hwy_contrib_sort_vqsort_i16a.cc.o -c ../../subprojects/highway/hwy/contrib/sort/vqsort_i16a.cc
In file included from ../../subprojects/highway/hwy/contrib/sort/vqsort.h:33,
from ../../subprojects/highway/hwy/contrib/sort/vqsort_i16a.cc:16:
../../subprojects/highway/hwy/base.h: In static member function ‘static uint64_t hwy::Divisor64::Div128(uint64_t, uint64_t)’:
../../subprojects/highway/hwy/base.h:3060:27: warning: ISO C++ does not support ‘__int128’ for ‘type name’ [-Wpedantic]
3060 | using u128 = unsigned __int128;
| ^~~~~~~~
../../subprojects/highway/hwy/base.h: In static member function ‘static uint64_t hwy::Divisor64::MulHigh(uint64_t, uint64_t)’:
../../subprojects/highway/hwy/base.h:3070:27: warning: ISO C++ does not support ‘__int128’ for ‘type name’ [-Wpedantic]
3070 | using u128 = unsigned __int128;
| ^~~~~~~~
c++: fatal error: Killed signal terminated program cc1plus
compilation terminated.
[273/362] Compiling C++ object subprojects/highway/libhwy_contrib.a.p/hwy_contrib_sort_vqsort_kv64d.cc.o
FAILED: subprojects/highway/libhwy_contrib.a.p/hwy_contrib_sort_vqsort_kv64d.cc.o
c++ -Isubprojects/highway/libhwy_contrib.a.p -Isubprojects/highway -I../../subprojects/highway -fvisibility=hidden -fvisibility-inlines-hidden -flto=auto -fdiagnostics-color=always -DNDEBUG -D_FILE_OFFSET_BITS=64 -Wall -Winvalid-pch -Wextra -Wpedantic -fno-exceptions -fno-rtti -std=c++17 -O3 -Wno-builtin-macro-redefined '-D__DATE__="redacted"' '-D__TIMESTAMP__="redacted"' '-D__TIME__="redacted"' -fmerge-all-constants -fmath-errno -DTOOLCHAIN_MISS_ASM_HWCAP_H -Wno-psabi -fPIC -pthread -DHWY_STATIC_DEFINE -MD -MQ subprojects/highway/libhwy_contrib.a.p/hwy_contrib_sort_vqsort_kv64d.cc.o -MF subprojects/highway/libhwy_contrib.a.p/hwy_contrib_sort_vqsort_kv64d.cc.o.d -o subprojects/highway/libhwy_contrib.a.p/hwy_contrib_sort_vqsort_kv64d.cc.o -c ../../subprojects/highway/hwy/contrib/sort/vqsort_kv64d.cc
In file included from ../../subprojects/highway/hwy/contrib/sort/vqsort.h:33,
from ../../subprojects/highway/hwy/contrib/sort/vqsort_kv64d.cc:16:
../../subprojects/highway/hwy/base.h: In static member function ‘static uint64_t hwy::Divisor64::Div128(uint64_t, uint64_t)’:
../../subprojects/highway/hwy/base.h:3060:27: warning: ISO C++ does not support ‘__int128’ for ‘type name’ [-Wpedantic]
3060 | using u128 = unsigned __int128;
| ^~~~~~~~
../../subprojects/highway/hwy/base.h: In static member function ‘static uint64_t hwy::Divisor64::MulHigh(uint64_t, uint64_t)’:
../../subprojects/highway/hwy/base.h:3070:27: warning: ISO C++ does not support ‘__int128’ for ‘type name’ [-Wpedantic]
3070 | using u128 = unsigned __int128;
| ^~~~~~~~
c++: fatal error: Killed signal terminated program cc1plus
compilation terminated.
[274/362] Compiling C++ object subprojects/highway/libhwy_contrib.a.p/hwy_contrib_sort_vqsort_u16a.cc.o
FAILED: subprojects/highway/libhwy_contrib.a.p/hwy_contrib_sort_vqsort_u16a.cc.o
c++ -Isubprojects/highway/libhwy_contrib.a.p -Isubprojects/highway -I../../subprojects/highway -fvisibility=hidden -fvisibility-inlines-hidden -flto=auto -fdiagnostics-color=always -DNDEBUG -D_FILE_OFFSET_BITS=64 -Wall -Winvalid-pch -Wextra -Wpedantic -fno-exceptions -fno-rtti -std=c++17 -O3 -Wno-builtin-macro-redefined '-D__DATE__="redacted"' '-D__TIMESTAMP__="redacted"' '-D__TIME__="redacted"' -fmerge-all-constants -fmath-errno -DTOOLCHAIN_MISS_ASM_HWCAP_H -Wno-psabi -fPIC -pthread -DHWY_STATIC_DEFINE -MD -MQ subprojects/highway/libhwy_contrib.a.p/hwy_contrib_sort_vqsort_u16a.cc.o -MF subprojects/highway/libhwy_contrib.a.p/hwy_contrib_sort_vqsort_u16a.cc.o.d -o subprojects/highway/libhwy_contrib.a.p/hwy_contrib_sort_vqsort_u16a.cc.o -c ../../subprojects/highway/hwy/contrib/sort/vqsort_u16a.cc
In file included from ../../subprojects/highway/hwy/contrib/sort/vqsort.h:33,
from ../../subprojects/highway/hwy/contrib/sort/vqsort_u16a.cc:16:
../../subprojects/highway/hwy/base.h: In static member function ‘static uint64_t hwy::Divisor64::Div128(uint64_t, uint64_t)’:
../../subprojects/highway/hwy/base.h:3060:27: warning: ISO C++ does not support ‘__int128’ for ‘type name’ [-Wpedantic]
3060 | using u128 = unsigned __int128;
| ^~~~~~~~
../../subprojects/highway/hwy/base.h: In static member function ‘static uint64_t hwy::Divisor64::MulHigh(uint64_t, uint64_t)’:
../../subprojects/highway/hwy/base.h:3070:27: warning: ISO C++ does not support ‘__int128’ for ‘type name’ [-Wpedantic]
3070 | using u128 = unsigned __int128;
| ^~~~~~~~
c++: fatal error: Killed signal terminated program cc1plus
compilation terminated.
[275/362] Compiling C++ object lc0.p/src_utils_logging.cc.o
[276/362] Compiling C++ object subprojects/highway/libhwy_contrib.a.p/hwy_contrib_sort_vqsort_i64a.cc.o
FAILED: subprojects/highway/libhwy_contrib.a.p/hwy_contrib_sort_vqsort_i64a.cc.o
c++ -Isubprojects/highway/libhwy_contrib.a.p -Isubprojects/highway -I../../subprojects/highway -fvisibility=hidden -fvisibility-inlines-hidden -flto=auto -fdiagnostics-color=always -DNDEBUG -D_FILE_OFFSET_BITS=64 -Wall -Winvalid-pch -Wextra -Wpedantic -fno-exceptions -fno-rtti -std=c++17 -O3 -Wno-builtin-macro-redefined '-D__DATE__="redacted"' '-D__TIMESTAMP__="redacted"' '-D__TIME__="redacted"' -fmerge-all-constants -fmath-errno -DTOOLCHAIN_MISS_ASM_HWCAP_H -Wno-psabi -fPIC -pthread -DHWY_STATIC_DEFINE -MD -MQ subprojects/highway/libhwy_contrib.a.p/hwy_contrib_sort_vqsort_i64a.cc.o -MF subprojects/highway/libhwy_contrib.a.p/hwy_contrib_sort_vqsort_i64a.cc.o.d -o subprojects/highway/libhwy_contrib.a.p/hwy_contrib_sort_vqsort_i64a.cc.o -c ../../subprojects/highway/hwy/contrib/sort/vqsort_i64a.cc
In file included from ../../subprojects/highway/hwy/contrib/sort/vqsort.h:33,
from ../../subprojects/highway/hwy/contrib/sort/vqsort_i64a.cc:16:
../../subprojects/highway/hwy/base.h: In static member function ‘static uint64_t hwy::Divisor64::Div128(uint64_t, uint64_t)’:
../../subprojects/highway/hwy/base.h:3060:27: warning: ISO C++ does not support ‘__int128’ for ‘type name’ [-Wpedantic]
3060 | using u128 = unsigned __int128;
| ^~~~~~~~
../../subprojects/highway/hwy/base.h: In static member function ‘static uint64_t hwy::Divisor64::MulHigh(uint64_t, uint64_t)’:
../../subprojects/highway/hwy/base.h:3070:27: warning: ISO C++ does not support ‘__int128’ for ‘type name’ [-Wpedantic]
3070 | using u128 = unsigned __int128;
| ^~~~~~~~
c++: fatal error: Killed signal terminated program cc1plus
compilation terminated.
[277/362] Compiling C++ object lc0.p/src_utils_random.cc.o
[278/362] Compiling C++ object subprojects/highway/libhwy_contrib.a.p/hwy_contrib_sort_vqsort_128a.cc.o
FAILED: subprojects/highway/libhwy_contrib.a.p/hwy_contrib_sort_vqsort_128a.cc.o
c++ -Isubprojects/highway/libhwy_contrib.a.p -Isubprojects/highway -I../../subprojects/highway -fvisibility=hidden -fvisibility-inlines-hidden -flto=auto -fdiagnostics-color=always -DNDEBUG -D_FILE_OFFSET_BITS=64 -Wall -Winvalid-pch -Wextra -Wpedantic -fno-exceptions -fno-rtti -std=c++17 -O3 -Wno-builtin-macro-redefined '-D__DATE__="redacted"' '-D__TIMESTAMP__="redacted"' '-D__TIME__="redacted"' -fmerge-all-constants -fmath-errno -DTOOLCHAIN_MISS_ASM_HWCAP_H -Wno-psabi -fPIC -pthread -DHWY_STATIC_DEFINE -MD -MQ subprojects/highway/libhwy_contrib.a.p/hwy_contrib_sort_vqsort_128a.cc.o -MF subprojects/highway/libhwy_contrib.a.p/hwy_contrib_sort_vqsort_128a.cc.o.d -o subprojects/highway/libhwy_contrib.a.p/hwy_contrib_sort_vqsort_128a.cc.o -c ../../subprojects/highway/hwy/contrib/sort/vqsort_128a.cc
In file included from ../../subprojects/highway/hwy/contrib/sort/vqsort.h:33,
from ../../subprojects/highway/hwy/contrib/sort/vqsort_128a.cc:16:
../../subprojects/highway/hwy/base.h: In static member function ‘static uint64_t hwy::Divisor64::Div128(uint64_t, uint64_t)’:
../../subprojects/highway/hwy/base.h:3060:27: warning: ISO C++ does not support ‘__int128’ for ‘type name’ [-Wpedantic]
3060 | using u128 = unsigned __int128;
| ^~~~~~~~
../../subprojects/highway/hwy/base.h: In static member function ‘static uint64_t hwy::Divisor64::MulHigh(uint64_t, uint64_t)’:
../../subprojects/highway/hwy/base.h:3070:27: warning: ISO C++ does not support ‘__int128’ for ‘type name’ [-Wpedantic]
3070 | using u128 = unsigned __int128;
| ^~~~~~~~
c++: fatal error: Killed signal terminated program cc1plus
compilation terminated.
[279/362] Compiling C++ object subprojects/highway/libhwy_contrib.a.p/hwy_contrib_sort_vqsort_f16d.cc.o
In file included from ../../subprojects/highway/hwy/contrib/sort/vqsort.h:33,
from ../../subprojects/highway/hwy/contrib/sort/vqsort_f16d.cc:16:
../../subprojects/highway/hwy/base.h: In static member function ‘static uint64_t hwy::Divisor64::Div128(uint64_t, uint64_t)’:
../../subprojects/highway/hwy/base.h:3060:27: warning: ISO C++ does not support ‘__int128’ for ‘type name’ [-Wpedantic]
3060 | using u128 = unsigned __int128;
| ^~~~~~~~
../../subprojects/highway/hwy/base.h: In static member function ‘static uint64_t hwy::Divisor64::MulHigh(uint64_t, uint64_t)’:
../../subprojects/highway/hwy/base.h:3070:27: warning: ISO C++ does not support ‘__int128’ for ‘type name’ [-Wpedantic]
3070 | using u128 = unsigned __int128;
| ^~~~~~~~
[280/362] Compiling C++ object lc0.p/src_utils_filesystem.posix.cc.o
[281/362] Compiling C++ object subprojects/highway/libhwy_contrib.a.p/hwy_contrib_sort_vqsort_kv64a.cc.o
FAILED: subprojects/highway/libhwy_contrib.a.p/hwy_contrib_sort_vqsort_kv64a.cc.o
c++ -Isubprojects/highway/libhwy_contrib.a.p -Isubprojects/highway -I../../subprojects/highway -fvisibility=hidden -fvisibility-inlines-hidden -flto=auto -fdiagnostics-color=always -DNDEBUG -D_FILE_OFFSET_BITS=64 -Wall -Winvalid-pch -Wextra -Wpedantic -fno-exceptions -fno-rtti -std=c++17 -O3 -Wno-builtin-macro-redefined '-D__DATE__="redacted"' '-D__TIMESTAMP__="redacted"' '-D__TIME__="redacted"' -fmerge-all-constants -fmath-errno -DTOOLCHAIN_MISS_ASM_HWCAP_H -Wno-psabi -fPIC -pthread -DHWY_STATIC_DEFINE -MD -MQ subprojects/highway/libhwy_contrib.a.p/hwy_contrib_sort_vqsort_kv64a.cc.o -MF subprojects/highway/libhwy_contrib.a.p/hwy_contrib_sort_vqsort_kv64a.cc.o.d -o subprojects/highway/libhwy_contrib.a.p/hwy_contrib_sort_vqsort_kv64a.cc.o -c ../../subprojects/highway/hwy/contrib/sort/vqsort_kv64a.cc
In file included from ../../subprojects/highway/hwy/contrib/sort/vqsort.h:33,
from ../../subprojects/highway/hwy/contrib/sort/vqsort_kv64a.cc:16:
../../subprojects/highway/hwy/base.h: In static member function ‘static uint64_t hwy::Divisor64::Div128(uint64_t, uint64_t)’:
../../subprojects/highway/hwy/base.h:3060:27: warning: ISO C++ does not support ‘__int128’ for ‘type name’ [-Wpedantic]
3060 | using u128 = unsigned __int128;
| ^~~~~~~~
../../subprojects/highway/hwy/base.h: In static member function ‘static uint64_t hwy::Divisor64::MulHigh(uint64_t, uint64_t)’:
../../subprojects/highway/hwy/base.h:3070:27: warning: ISO C++ does not support ‘__int128’ for ‘type name’ [-Wpedantic]
3070 | using u128 = unsigned __int128;
| ^~~~~~~~
c++: fatal error: Killed signal terminated program cc1plus
compilation terminated.
[282/362] Compiling C++ object subprojects/highway/libhwy_contrib.a.p/hwy_contrib_sort_vqsort_u64a.cc.o
FAILED: subprojects/highway/libhwy_contrib.a.p/hwy_contrib_sort_vqsort_u64a.cc.o
c++ -Isubprojects/highway/libhwy_contrib.a.p -Isubprojects/highway -I../../subprojects/highway -fvisibility=hidden -fvisibility-inlines-hidden -flto=auto -fdiagnostics-color=always -DNDEBUG -D_FILE_OFFSET_BITS=64 -Wall -Winvalid-pch -Wextra -Wpedantic -fno-exceptions -fno-rtti -std=c++17 -O3 -Wno-builtin-macro-redefined '-D__DATE__="redacted"' '-D__TIMESTAMP__="redacted"' '-D__TIME__="redacted"' -fmerge-all-constants -fmath-errno -DTOOLCHAIN_MISS_ASM_HWCAP_H -Wno-psabi -fPIC -pthread -DHWY_STATIC_DEFINE -MD -MQ subprojects/highway/libhwy_contrib.a.p/hwy_contrib_sort_vqsort_u64a.cc.o -MF subprojects/highway/libhwy_contrib.a.p/hwy_contrib_sort_vqsort_u64a.cc.o.d -o subprojects/highway/libhwy_contrib.a.p/hwy_contrib_sort_vqsort_u64a.cc.o -c ../../subprojects/highway/hwy/contrib/sort/vqsort_u64a.cc
In file included from ../../subprojects/highway/hwy/contrib/sort/vqsort.h:33,
from ../../subprojects/highway/hwy/contrib/sort/vqsort_u64a.cc:16:
../../subprojects/highway/hwy/base.h: In static member function ‘static uint64_t hwy::Divisor64::Div128(uint64_t, uint64_t)’:
../../subprojects/highway/hwy/base.h:3060:27: warning: ISO C++ does not support ‘__int128’ for ‘type name’ [-Wpedantic]
3060 | using u128 = unsigned __int128;
| ^~~~~~~~
../../subprojects/highway/hwy/base.h: In static member function ‘static uint64_t hwy::Divisor64::MulHigh(uint64_t, uint64_t)’:
../../subprojects/highway/hwy/base.h:3070:27: warning: ISO C++ does not support ‘__int128’ for ‘type name’ [-Wpedantic]
3070 | using u128 = unsigned __int128;
| ^~~~~~~~
c++: fatal error: Killed signal terminated program cc1plus
compilation terminated.
[283/362] Compiling C++ object liblc0_lib.so.p/src_utils_string.cc.o
[284/362] Compiling C++ object lc0.p/src_search_dag_classic_wrapper.cc.o
In file included from ../../src/search/dag_classic/wrapper.cc:32:
../../src/search/dag_classic/search.h:54:32: warning: unknown option after ‘#pragma GCC diagnostic’ kind [-Wpragmas]
54 | #pragma GCC diagnostic ignored "-Winterference-size"
| ^~~~~~~~~~~~~~~~~~~~~
[285/362] Compiling C++ object lc0.p/src_utils_optionsparser.cc.o
[286/362] Compiling C++ object lc0.p/src_neural_factory.cc.o
[287/362] Compiling C++ object lc0.p/src_neural_loader.cc.o
[288/362] Compiling C++ object liblc0_lib.so.p/src_utils_protomessage.cc.o
[289/362] Compiling C++ object liblc0_lib.so.p/src_version.cc.o
[290/362] Compiling C++ object lc0.p/src_search_classic_node.cc.o
[291/362] Compiling C++ object lc0.p/src_trainingdata_writer.cc.o
[292/362] Compiling C++ object lc0.p/src_search_dag_classic_node.cc.o
In file included from ../../src/search/dag_classic/node.cc:41:
../../src/search/dag_classic/search.h:54:32: warning: unknown option after ‘#pragma GCC diagnostic’ kind [-Wpragmas]
54 | #pragma GCC diagnostic ignored "-Winterference-size"
| ^~~~~~~~~~~~~~~~~~~~~
[293/362] Compiling C++ object lc0.p/src_utils_optionsdict.cc.o
[294/362] Compiling C++ object liblc0_lib.so.p/src_chess_uciloop.cc.o
[295/362] Compiling C++ object liblc0_lib.so.p/src_neural_batchsplit.cc.o
[296/362] Compiling C++ object liblc0_lib.so.p/src_utils_commandline.cc.o
[297/362] Compiling C++ object liblc0_lib.so.p/src_neural_decoder.cc.o
[298/362] Compiling C++ object lc0.p/src_neural_backends_cuda_network_cuda.cc.o
[299/362] Compiling C++ object lc0.p/src_neural_shared_params.cc.o
[300/362] Compiling C++ object liblc0_lib.so.p/src_utils_optionsparser.cc.o
[301/362] Compiling C++ object lc0.p/src_search_dag_classic_search.cc.o
In file included from ../../src/search/dag_classic/search.cc:28:
../../src/search/dag_classic/search.h:54:32: warning: unknown option after ‘#pragma GCC diagnostic’ kind [-Wpragmas]
54 | #pragma GCC diagnostic ignored "-Winterference-size"
| ^~~~~~~~~~~~~~~~~~~~~
[302/362] Compiling C++ object lc0.p/src_trainingdata_trainingdata.cc.o
[303/362] Compiling C++ object liblc0_lib.so.p/src_utils_logging.cc.o
[304/362] Compiling C++ object liblc0_lib.so.p/src_neural_register.cc.o
[305/362] Compiling C++ object liblc0_lib.so.p/src_utils_files.cc.o
[306/362] Compiling C++ object lc0.p/src_trainingdata_reader.cc.o
[307/362] Compiling C++ object liblc0_lib.so.p/src_utils_configfile.cc.o
[308/362] Compiling C++ object lc0.p/src_neural_backends_blas_network_blas.cc.o
[309/362] Compiling C++ object lc0.p/src_neural_wrapper.cc.o
[310/362] Compiling C++ object liblc0_lib.so.p/src_neural_loader.cc.o
[311/362] Compiling C++ object liblc0_lib.so.p/src_neural_shared_params.cc.o
[312/362] Compiling C++ object liblc0_lib.so.p/src_utils_random.cc.o
[313/362] Compiling C++ object subprojects/highway/libhwy_contrib.a.p/hwy_contrib_sort_vqsort_i64d.cc.o
In file included from ../../subprojects/highway/hwy/contrib/sort/vqsort.h:33,
from ../../subprojects/highway/hwy/contrib/sort/vqsort_i64d.cc:16:
../../subprojects/highway/hwy/base.h: In static member function ‘static uint64_t hwy::Divisor64::Div128(uint64_t, uint64_t)’:
../../subprojects/highway/hwy/base.h:3060:27: warning: ISO C++ does not support ‘__int128’ for ‘type name’ [-Wpedantic]
3060 | using u128 = unsigned __int128;
| ^~~~~~~~
../../subprojects/highway/hwy/base.h: In static member function ‘static uint64_t hwy::Divisor64::MulHigh(uint64_t, uint64_t)’:
../../subprojects/highway/hwy/base.h:3070:27: warning: ISO C++ does not support ‘__int128’ for ‘type name’ [-Wpedantic]
3070 | using u128 = unsigned __int128;
| ^~~~~~~~
[314/362] Compiling C++ object liblc0_lib.so.p/src_trainingdata_writer.cc.o
[315/362] Compiling C++ object liblc0_lib.so.p/src_neural_backend.cc.o
[316/362] Compiling C++ object liblc0_lib.so.p/src_utils_optionsdict.cc.o
[317/362] Compiling C++ object subprojects/highway/libhwy_contrib.a.p/hwy_contrib_sort_vqsort_kv128d.cc.o
In file included from ../../subprojects/highway/hwy/contrib/sort/vqsort.h:33,
from ../../subprojects/highway/hwy/contrib/sort/vqsort_kv128d.cc:16:
../../subprojects/highway/hwy/base.h: In static member function ‘static uint64_t hwy::Divisor64::Div128(uint64_t, uint64_t)’:
../../subprojects/highway/hwy/base.h:3060:27: warning: ISO C++ does not support ‘__int128’ for ‘type name’ [-Wpedantic]
3060 | using u128 = unsigned __int128;
| ^~~~~~~~
../../subprojects/highway/hwy/base.h: In static member function ‘static uint64_t hwy::Divisor64::MulHigh(uint64_t, uint64_t)’:
../../subprojects/highway/hwy/base.h:3070:27: warning: ISO C++ does not support ‘__int128’ for ‘type name’ [-Wpedantic]
3070 | using u128 = unsigned __int128;
| ^~~~~~~~
[318/362] Compiling C++ object liblc0_lib.so.p/src_neural_encoder.cc.o
[319/362] Compiling C++ object subprojects/highway/libhwy_contrib.a.p/hwy_contrib_sort_vqsort_f64a.cc.o
In file included from ../../subprojects/highway/hwy/contrib/sort/vqsort.h:33,
from ../../subprojects/highway/hwy/contrib/sort/vqsort_f64a.cc:16:
../../subprojects/highway/hwy/base.h: In static member function ‘static uint64_t hwy::Divisor64::Div128(uint64_t, uint64_t)’:
../../subprojects/highway/hwy/base.h:3060:27: warning: ISO C++ does not support ‘__int128’ for ‘type name’ [-Wpedantic]
3060 | using u128 = unsigned __int128;
| ^~~~~~~~
../../subprojects/highway/hwy/base.h: In static member function ‘static uint64_t hwy::Divisor64::MulHigh(uint64_t, uint64_t)’:
../../subprojects/highway/hwy/base.h:3070:27: warning: ISO C++ does not support ‘__int128’ for ‘type name’ [-Wpedantic]
3070 | using u128 = unsigned __int128;
| ^~~~~~~~
[320/362] Compiling C++ object liblc0_lib.so.p/src_trainingdata_trainingdata.cc.o
[321/362] Compiling C++ object subprojects/highway/libhwy_contrib.a.p/hwy_contrib_sort_vqsort_u64d.cc.o
In file included from ../../subprojects/highway/hwy/contrib/sort/vqsort.h:33,
from ../../subprojects/highway/hwy/contrib/sort/vqsort_u64d.cc:16:
../../subprojects/highway/hwy/base.h: In static member function ‘static uint64_t hwy::Divisor64::Div128(uint64_t, uint64_t)’:
../../subprojects/highway/hwy/base.h:3060:27: warning: ISO C++ does not support ‘__int128’ for ‘type name’ [-Wpedantic]
3060 | using u128 = unsigned __int128;
| ^~~~~~~~
../../subprojects/highway/hwy/base.h: In static member function ‘static uint64_t hwy::Divisor64::MulHigh(uint64_t, uint64_t)’:
../../subprojects/highway/hwy/base.h:3070:27: warning: ISO C++ does not support ‘__int128’ for ‘type name’ [-Wpedantic]
3070 | using u128 = unsigned __int128;
| ^~~~~~~~
[322/362] Compiling C++ object liblc0_lib.so.p/src_syzygy_syzygy.cc.o
[323/362] Compiling C++ object liblc0_lib.so.p/src_neural_factory.cc.o
[324/362] Compiling C++ object liblc0_lib.so.p/src_search_classic_node.cc.o
[325/362] Compiling C++ object liblc0_lib.so.p/src_neural_wrapper.cc.o
[326/362] Compiling C++ object liblc0_lib.so.p/src_trainingdata_reader.cc.o
[327/362] Compiling C++ object subprojects/highway/libhwy_contrib.a.p/hwy_contrib_sort_vqsort_kv128a.cc.o
In file included from ../../subprojects/highway/hwy/contrib/sort/vqsort.h:33,
from ../../subprojects/highway/hwy/contrib/sort/vqsort_kv128a.cc:16:
../../subprojects/highway/hwy/base.h: In static member function ‘static uint64_t hwy::Divisor64::Div128(uint64_t, uint64_t)’:
../../subprojects/highway/hwy/base.h:3060:27: warning: ISO C++ does not support ‘__int128’ for ‘type name’ [-Wpedantic]
3060 | using u128 = unsigned __int128;
| ^~~~~~~~
../../subprojects/highway/hwy/base.h: In static member function ‘static uint64_t hwy::Divisor64::MulHigh(uint64_t, uint64_t)’:
../../subprojects/highway/hwy/base.h:3070:27: warning: ISO C++ does not support ‘__int128’ for ‘type name’ [-Wpedantic]
3070 | using u128 = unsigned __int128;
| ^~~~~~~~
[328/362] Compiling C++ object subprojects/highway/libhwy_contrib.a.p/hwy_contrib_sort_vqsort_i32d.cc.o
In file included from ../../subprojects/highway/hwy/contrib/sort/vqsort.h:33,
from ../../subprojects/highway/hwy/contrib/sort/vqsort_i32d.cc:16:
../../subprojects/highway/hwy/base.h: In static member function ‘static uint64_t hwy::Divisor64::Div128(uint64_t, uint64_t)’:
../../subprojects/highway/hwy/base.h:3060:27: warning: ISO C++ does not support ‘__int128’ for ‘type name’ [-Wpedantic]
3060 | using u128 = unsigned __int128;
| ^~~~~~~~
../../subprojects/highway/hwy/base.h: In static member function ‘static uint64_t hwy::Divisor64::MulHigh(uint64_t, uint64_t)’:
../../subprojects/highway/hwy/base.h:3070:27: warning: ISO C++ does not support ‘__int128’ for ‘type name’ [-Wpedantic]
3070 | using u128 = unsigned __int128;
| ^~~~~~~~
[329/362] Compiling C++ object subprojects/highway/libhwy_contrib.a.p/hwy_contrib_sort_vqsort_f32d.cc.o
In file included from ../../subprojects/highway/hwy/contrib/sort/vqsort.h:33,
from ../../subprojects/highway/hwy/contrib/sort/vqsort_f32d.cc:16:
../../subprojects/highway/hwy/base.h: In static member function ‘static uint64_t hwy::Divisor64::Div128(uint64_t, uint64_t)’:
../../subprojects/highway/hwy/base.h:3060:27: warning: ISO C++ does not support ‘__int128’ for ‘type name’ [-Wpedantic]
3060 | using u128 = unsigned __int128;
| ^~~~~~~~
../../subprojects/highway/hwy/base.h: In static member function ‘static uint64_t hwy::Divisor64::MulHigh(uint64_t, uint64_t)’:
../../subprojects/highway/hwy/base.h:3070:27: warning: ISO C++ does not support ‘__int128’ for ‘type name’ [-Wpedantic]
3070 | using u128 = unsigned __int128;
| ^~~~~~~~
[330/362] Compiling C++ object subprojects/highway/libhwy_contrib.a.p/hwy_contrib_sort_vqsort_u32a.cc.o
In file included from ../../subprojects/highway/hwy/contrib/sort/vqsort.h:33,
from ../../subprojects/highway/hwy/contrib/sort/vqsort_u32a.cc:16:
../../subprojects/highway/hwy/base.h: In static member function ‘static uint64_t hwy::Divisor64::Div128(uint64_t, uint64_t)’:
../../subprojects/highway/hwy/base.h:3060:27: warning: ISO C++ does not support ‘__int128’ for ‘type name’ [-Wpedantic]
3060 | using u128 = unsigned __int128;
| ^~~~~~~~
../../subprojects/highway/hwy/base.h: In static member function ‘static uint64_t hwy::Divisor64::MulHigh(uint64_t, uint64_t)’:
../../subprojects/highway/hwy/base.h:3070:27: warning: ISO C++ does not support ‘__int128’ for ‘type name’ [-Wpedantic]
3070 | using u128 = unsigned __int128;
| ^~~~~~~~
[331/362] Compiling C++ object subprojects/highway/libhwy_contrib.a.p/hwy_contrib_sort_vqsort_u32d.cc.o
In file included from ../../subprojects/highway/hwy/contrib/sort/vqsort.h:33,
from ../../subprojects/highway/hwy/contrib/sort/vqsort_u32d.cc:16:
../../subprojects/highway/hwy/base.h: In static member function ‘static uint64_t hwy::Divisor64::Div128(uint64_t, uint64_t)’:
../../subprojects/highway/hwy/base.h:3060:27: warning: ISO C++ does not support ‘__int128’ for ‘type name’ [-Wpedantic]
3060 | using u128 = unsigned __int128;
| ^~~~~~~~
../../subprojects/highway/hwy/base.h: In static member function ‘static uint64_t hwy::Divisor64::MulHigh(uint64_t, uint64_t)’:
../../subprojects/highway/hwy/base.h:3070:27: warning: ISO C++ does not support ‘__int128’ for ‘type name’ [-Wpedantic]
3070 | using u128 = unsigned __int128;
| ^~~~~~~~
[332/362] Compiling C++ object subprojects/highway/libhwy_contrib.a.p/hwy_contrib_sort_vqsort_u16d.cc.o
In file included from ../../subprojects/highway/hwy/contrib/sort/vqsort.h:33,
from ../../subprojects/highway/hwy/contrib/sort/vqsort_u16d.cc:16:
../../subprojects/highway/hwy/base.h: In static member function ‘static uint64_t hwy::Divisor64::Div128(uint64_t, uint64_t)’:
../../subprojects/highway/hwy/base.h:3060:27: warning: ISO C++ does not support ‘__int128’ for ‘type name’ [-Wpedantic]
3060 | using u128 = unsigned __int128;
| ^~~~~~~~
../../subprojects/highway/hwy/base.h: In static member function ‘static uint64_t hwy::Divisor64::MulHigh(uint64_t, uint64_t)’:
../../subprojects/highway/hwy/base.h:3070:27: warning: ISO C++ does not support ‘__int128’ for ‘type name’ [-Wpedantic]
3070 | using u128 = unsigned __int128;
| ^~~~~~~~
[333/362] Generating cuda cutlass code with a custom command
[334/362] Generating cuda fp32 code with a custom command
[335/362] Generating cuda fp16 code with a custom command
ninja: build stopped: subcommand failed.
make: *** [Makefile:23: all] Error 1