chmod +x ../build.sh
../build.sh --buildtype=debugoptimized -Dtimer_backtrace=true -Dembed=true && mv ../build/release/lc0 Leela-dag-preview-pro-FB2A4226-551644D7
The Meson build system
Version: 1.12.0
Source dir: /tmp/tmpahnpoc63/Leela-dag-preview/Leela-dag-preview-tmp
Build dir: /tmp/tmpahnpoc63/Leela-dag-preview/Leela-dag-preview-tmp/build/release
Build type: native build
DEPRECATION: WrapDB v1 is deprecated, updated using `meson wrap update zlib`
Project name: lc0
Project version: undefined
C++ compiler for the host machine: c++ (gcc 11.4.0 "c++ (Ubuntu 11.4.0-1ubuntu1~22.04) 11.4.0")
C++ linker for the host machine: c++ ld.bfd 2.38
Host machine cpu family: x86_64
Host machine cpu: x86_64
Program scripts/compile_proto.py found: YES (/usr/bin/python3 /tmp/tmpahnpoc63/Leela-dag-preview/Leela-dag-preview-tmp/scripts/compile_proto.py)
Program git found: YES (/usr/bin/git)
meson.build:92: WARNING: Failed to parse short revision. Use git clone instead of downloading the archive from GitHub.
Message: Using build identifier "git.unknown".
Configuring build_id.h using configuration
Found pkg-config: YES (/usr/bin/pkg-config) 0.29.2
Found CMake: /usr/bin/cmake (3.22.1)
Run-time dependency absl_flat_hash_map found: NO (tried pkg-config and cmake)
Run-time dependency absl found: NO (tried pkg-config and cmake)
Looking for a fallback subproject for the dependency absl_flat_hash_map (modules: absl::flat_hash_map)
Downloading abseil-cpp source from https://github.com/abseil/abseil-cpp/releases/download/20240722.0/abseil-cpp-20240722.0.tar.gz
Executing subproject abseil-cpp for machine: host
abseil-cpp| Project name: abseil-cpp
abseil-cpp| Project version: 20240722.0
abseil-cpp| C++ compiler for the host machine: c++ (gcc 11.4.0 "c++ (Ubuntu 11.4.0-1ubuntu1~22.04) 11.4.0")
abseil-cpp| C++ linker for the host machine: c++ ld.bfd 2.38
abseil-cpp| Compiler for C++ supports arguments /DNOMINMAX: NO
abseil-cpp| Compiler for C++ supports arguments -Wno-sign-compare: YES
abseil-cpp| Compiler for C++ supports arguments -Wno-gcc-compat: NO
abseil-cpp| Compiler for C++ supports arguments -maes: YES
abseil-cpp| Compiler for C++ supports arguments -msse4.1: YES
abseil-cpp| Checking if "atomic builtins" links: YES
abseil-cpp| Run-time dependency threads found: YES
abseil-cpp| Run-time dependency appleframeworks found: NO (tried framework)
abseil-cpp| Build targets in project: 15
abseil-cpp| Subproject abseil-cpp finished.
Dependency absl_flat_hash_map (modules: absl::flat_hash_map) for host machine from subproject subprojects/abseil-cpp-20240722.0 found: YES 20240722.0
Run-time dependency libhwy found: NO (tried pkg-config and cmake)
Looking for a fallback subproject for the dependency libhwy
Cloning into 'highway'...
Executing subproject highway for machine: host
highway| Project name: hwy
highway| Project version: 1.4.0
highway| C++ compiler for the host machine: c++ (gcc 11.4.0 "c++ (Ubuntu 11.4.0-1ubuntu1~22.04) 11.4.0")
highway| C++ linker for the host machine: c++ ld.bfd 2.38
highway| Compiler for C++ supports arguments -Wno-gnu-zero-variadic-macro-arguments: NO
highway| Checking if define "__EMSCRIPTEN__" exists: NO
highway| Checking if define "__riscv" exists: NO
highway| Has header "sys/auxv.h" : YES
highway| Has header "asm/hwcap.h" : NO
highway| Compiler for C++ supports link arguments -Wl,--version-script=/tmp/tmpahnpoc63/Leela-dag-preview/Leela-dag-preview-tmp/subprojects/highway/hwy/hwy.version: YES
highway| First supported link argument: -Wl,--version-script=/tmp/tmpahnpoc63/Leela-dag-preview/Leela-dag-preview-tmp/subprojects/highway/hwy/hwy.version
highway| Found pkg-config: YES (/usr/bin/pkg-config) 0.29.2
highway| Dependency threads for host machine found: YES unknown (cached)
highway| Run-time dependency GTest found: YES 1.11.0
highway| Build targets in project: 19
highway| Subproject highway finished.
Dependency libhwy for host machine from subproject subprojects/highway found: YES 1.4.0
Dependency threads for host machine found: YES unknown (cached)
Library dl found: YES
Run-time dependency tensorflow_cc found: NO (tried pkg-config and cmake)
Run-time dependency accelerate found: NO (tried pkg-config and cmake)
Library mkl_rt found: NO
Library mklml found: NO
Library dnnl found: NO
Library openblas.dll found: NO
Library openblas found: YES
Has header "openblas_config.h" : YES
Run-time dependency eigen3 found: NO (tried pkg-config and cmake)
Looking for a fallback subproject for the dependency eigen3
Downloading eigen source from https://gitlab.com/libeigen/eigen/-/archive/3.4.0/eigen-3.4.0.tar.bz2
Downloading file of unknown size.
Downloading eigen patch from https://wrapdb.mesonbuild.com/v2/eigen_3.4.0-2/get_patch
Executing subproject eigen for machine: host
eigen| Project name: eigen
eigen| Project version: 3.4.0
eigen| C++ compiler for the host machine: c++ (gcc 11.4.0 "c++ (Ubuntu 11.4.0-1ubuntu1~22.04) 11.4.0")
eigen| C++ linker for the host machine: c++ ld.bfd 2.38
eigen| Build targets in project: 19
eigen| Subproject eigen finished.
Dependency eigen3 for host machine from subproject subprojects/eigen-3.4.0 found: YES 3.4.0
Has header "Eigen/Core" : YES
Program ispc found: NO
Library OpenCL found: NO
Run-time dependency opencl found: NO
Message: Looking for nvcc in: /opt/cuda/lib64/bin/nvcc, /usr/local/cuda/lib64/bin/nvcc, /usr/lib/cuda/lib64/bin/nvcc, nvcc, /usr/local/cuda/bin/nvcc, /opt/cuda/bin/nvcc
Library cublas found: YES
Library cudnn found: NO
Library cudart found: YES
Program nvcc found: YES (/usr/local/cuda/bin/nvcc)
Message: Detected NVCC C++ standard support: 20
Message: Detected maximum CUDA architecture: 1200
Message: Building with CUTLASS support
Cloning into 'cutlass'...
Updating files: 63% (5052/7897)
Updating files: 64% (5055/7897)
Updating files: 65% (5134/7897)
Updating files: 66% (5213/7897)
Updating files: 67% (5291/7897)
Updating files: 68% (5370/7897)
Updating files: 69% (5449/7897)
Updating files: 70% (5528/7897)
Updating files: 71% (5607/7897)
Updating files: 72% (5686/7897)
Updating files: 73% (5765/7897)
Updating files: 74% (5844/7897)
Updating files: 75% (5923/7897)
Updating files: 76% (6002/7897)
Updating files: 77% (6081/7897)
Updating files: 78% (6160/7897)
Updating files: 79% (6239/7897)
Updating files: 80% (6318/7897)
Updating files: 81% (6397/7897)
Updating files: 82% (6476/7897)
Updating files: 83% (6555/7897)
Updating files: 84% (6634/7897)
Updating files: 85% (6713/7897)
Updating files: 86% (6792/7897)
Updating files: 87% (6871/7897)
Updating files: 88% (6950/7897)
Updating files: 89% (7029/7897)
Updating files: 90% (7108/7897)
Updating files: 91% (7187/7897)
Updating files: 92% (7266/7897)
Updating files: 93% (7345/7897)
Updating files: 94% (7424/7897)
Updating files: 95% (7503/7897)
Updating files: 96% (7582/7897)
Updating files: 97% (7661/7897)
Updating files: 98% (7740/7897)
Updating files: 99% (7819/7897)
Updating files: 100% (7897/7897)
Updating files: 100% (7897/7897), done.
HEAD is now at 4370102f v4.4.1 update (#3080)
Executing subproject cutlass for machine: host
cutlass| Project name: cutlass
cutlass| Project version: undefined
cutlass| C++ compiler for the host machine: c++ (gcc 11.4.0 "c++ (Ubuntu 11.4.0-1ubuntu1~22.04) 11.4.0")
cutlass| C++ linker for the host machine: c++ ld.bfd 2.38
cutlass| Build targets in project: 19
cutlass| Subproject cutlass finished.
Library onnxruntime found: NO
Run-time dependency appleframeworks found: NO (tried framework)
Run-time dependency zlib found: YES 1.2.11
Run-time dependency hwloc found: NO (tried pkg-config and cmake)
Configuring numa_config.h using configuration
Configuring trace_config.h using configuration
Run-time dependency libunwind found: YES 1.3.2
Run-time dependency libunwind-generic found: YES 1.3.2
Configuring backtrace_config.h using configuration
Library profiler found: NO
Library atomic found: YES
Checking for type "_Float16" : NO
Configuring default_search.h using configuration
Configuring default_backend.h using configuration
Dependency gtest for host machine found: YES 1.11.0 (cached)
Run-time dependency GMock found: YES (building self)
Build targets in project: 32
lc0 undefined
Subprojects (for host machine)
abseil-cpp : YES
cutlass : YES
eigen : YES
highway : YES
User defined options
buildtype : debugoptimized
embed : true
prefix : /usr/local
timer_backtrace: true
Found ninja-1.10.1 at /usr/bin/ninja
INFO: autodetecting backend as ninja
INFO: calculating backend command to run: /usr/bin/ninja -C /tmp/tmpahnpoc63/Leela-dag-preview/Leela-dag-preview-tmp/build/release
ninja: Entering directory `/tmp/tmpahnpoc63/Leela-dag-preview/Leela-dag-preview-tmp/build/release'
[1/363] Compiling C++ object subprojects/abseil-cpp-20240722.0/libabsl_base.a.p/absl_base_internal_poison.cc.o
[2/363] Compiling C++ object subprojects/abseil-cpp-20240722.0/libabsl_strings.a.p/absl_strings_internal_utf8.cc.o
[3/363] Compiling C++ object subprojects/abseil-cpp-20240722.0/libabsl_base.a.p/absl_base_internal_unscaledcycleclock.cc.o
[4/363] Compiling C++ object subprojects/abseil-cpp-20240722.0/libabsl_strings.a.p/absl_strings_internal_pow10_helper.cc.o
[5/363] Compiling C++ object subprojects/abseil-cpp-20240722.0/libabsl_base.a.p/absl_base_internal_scoped_set_env.cc.o
[6/363] Compiling C++ object subprojects/abseil-cpp-20240722.0/libabsl_crc.a.p/absl_crc_internal_cpu_detect.cc.o
[7/363] Compiling C++ object subprojects/abseil-cpp-20240722.0/libabsl_base.a.p/absl_base_internal_strerror.cc.o
[8/363] Compiling C++ object subprojects/abseil-cpp-20240722.0/libabsl_base.a.p/absl_base_internal_spinlock_wait.cc.o
[9/363] Compiling C++ object subprojects/abseil-cpp-20240722.0/libabsl_strings.a.p/absl_strings_internal_ostringstream.cc.o
[10/363] Compiling C++ object subprojects/abseil-cpp-20240722.0/libabsl_base.a.p/absl_base_log_severity.cc.o
[11/363] Compiling C++ object subprojects/abseil-cpp-20240722.0/libabsl_base.a.p/absl_base_internal_raw_logging.cc.o
[12/363] Compiling C++ object subprojects/abseil-cpp-20240722.0/libabsl_debugging.a.p/absl_debugging_leak_check.cc.o
[13/363] Compiling C++ object subprojects/abseil-cpp-20240722.0/libabsl_profiling.a.p/absl_profiling_internal_periodic_sampler.cc.o
[14/363] Compiling C++ object subprojects/abseil-cpp-20240722.0/libabsl_strings.a.p/absl_strings_internal_memutil.cc.o
[15/363] Compiling C++ object subprojects/abseil-cpp-20240722.0/libabsl_base.a.p/absl_base_internal_cycleclock.cc.o
[16/363] Compiling C++ object subprojects/abseil-cpp-20240722.0/libabsl_debugging.a.p/absl_debugging_internal_utf8_for_code_point.cc.o
[17/363] Compiling C++ object subprojects/abseil-cpp-20240722.0/libabsl_base.a.p/absl_base_internal_throw_delegate.cc.o
[18/363] Compiling C++ object subprojects/abseil-cpp-20240722.0/libabsl_strings.a.p/absl_strings_internal_str_format_output.cc.o
[19/363] Compiling C++ object subprojects/abseil-cpp-20240722.0/libabsl_strings.a.p/absl_strings_internal_cordz_functions.cc.o
[20/363] Compiling C++ object subprojects/abseil-cpp-20240722.0/libabsl_hash.a.p/absl_hash_internal_city.cc.o
[21/363] Compiling C++ object subprojects/abseil-cpp-20240722.0/libabsl_random.a.p/absl_random_internal_randen_detect.cc.o
[22/363] Compiling C++ object subprojects/abseil-cpp-20240722.0/libabsl_debugging.a.p/absl_debugging_internal_demangle_rust.cc.o
[23/363] Compiling C++ object subprojects/abseil-cpp-20240722.0/libabsl_debugging.a.p/absl_debugging_stacktrace.cc.o
[24/363] Compiling C++ object subprojects/abseil-cpp-20240722.0/libabsl_random.a.p/absl_random_internal_randen_round_keys.cc.o
[25/363] Compiling C++ object subprojects/abseil-cpp-20240722.0/libabsl_base.a.p/absl_base_internal_thread_identity.cc.o
[26/363] Compiling C++ object subprojects/abseil-cpp-20240722.0/libabsl_debugging.a.p/absl_debugging_failure_signal_handler.cc.o
[27/363] Compiling C++ object subprojects/abseil-cpp-20240722.0/libabsl_strings.a.p/absl_strings_string_view.cc.o
[28/363] Compiling C++ object subprojects/abseil-cpp-20240722.0/libabsl_strings.a.p/absl_strings_internal_str_format_extension.cc.o
[29/363] Compiling C++ object subprojects/abseil-cpp-20240722.0/libabsl_profiling.a.p/absl_profiling_internal_exponential_biased.cc.o
[30/363] Linking static target subprojects/abseil-cpp-20240722.0/libabsl_profiling.a
[31/363] Compiling C++ object subprojects/abseil-cpp-20240722.0/libabsl_strings.a.p/absl_strings_internal_stringify_sink.cc.o
[32/363] Compiling C++ object subprojects/abseil-cpp-20240722.0/libabsl_base.a.p/absl_base_internal_low_level_alloc.cc.o
[33/363] Compiling C++ object subprojects/abseil-cpp-20240722.0/libabsl_hash.a.p/absl_hash_internal_low_level_hash.cc.o
[34/363] Compiling C++ object subprojects/abseil-cpp-20240722.0/libabsl_debugging.a.p/absl_debugging_internal_decode_rust_punycode.cc.o
[35/363] Compiling C++ object subprojects/abseil-cpp-20240722.0/libabsl_strings.a.p/absl_strings_ascii.cc.o
[36/363] Compiling C++ object subprojects/abseil-cpp-20240722.0/libabsl_crc.a.p/absl_crc_internal_crc_x86_arm_combined.cc.o
[37/363] Compiling C++ object subprojects/abseil-cpp-20240722.0/libabsl_debugging.a.p/absl_debugging_internal_stack_consumption.cc.o
[38/363] Compiling C++ object subprojects/abseil-cpp-20240722.0/libabsl_strings.a.p/absl_strings_match.cc.o
[39/363] Compiling C++ object subprojects/abseil-cpp-20240722.0/libabsl_debugging.a.p/absl_debugging_internal_address_is_readable.cc.o
[40/363] Compiling C++ object subprojects/abseil-cpp-20240722.0/libabsl_debugging.a.p/absl_debugging_internal_elf_mem_image.cc.o
[41/363] Compiling C++ object subprojects/abseil-cpp-20240722.0/libabsl_strings.a.p/absl_strings_internal_str_format_arg.cc.o
[42/363] Compiling C++ object subprojects/abseil-cpp-20240722.0/libabsl_crc.a.p/absl_crc_internal_crc_memcpy_x86_arm_combined.cc.o
[43/363] Compiling C++ object subprojects/abseil-cpp-20240722.0/libabsl_debugging.a.p/absl_debugging_internal_demangle.cc.o
[44/363] Compiling C++ object subprojects/abseil-cpp-20240722.0/libabsl_base.a.p/absl_base_internal_spinlock.cc.o
[45/363] Compiling C++ object subprojects/abseil-cpp-20240722.0/libabsl_strings.a.p/absl_strings_internal_cord_rep_btree_navigator.cc.o
[46/363] Compiling C++ object subprojects/abseil-cpp-20240722.0/libabsl_strings.a.p/absl_strings_cord_buffer.cc.o
[47/363] Compiling C++ object subprojects/abseil-cpp-20240722.0/libabsl_types.a.p/absl_types_bad_any_cast.cc.o
[48/363] Compiling C++ object subprojects/abseil-cpp-20240722.0/libabsl_strings.a.p/absl_strings_internal_charconv_parse.cc.o
[49/363] Compiling C++ object subprojects/abseil-cpp-20240722.0/libabsl_time.a.p/absl_time_internal_cctz_src_civil_time_detail.cc.o
[50/363] Compiling C++ object subprojects/abseil-cpp-20240722.0/libabsl_strings.a.p/absl_strings_internal_damerau_levenshtein_distance.cc.o
[51/363] Compiling C++ object subprojects/abseil-cpp-20240722.0/libabsl_numeric.a.p/absl_numeric_int128.cc.o
[52/363] Compiling C++ object subprojects/abseil-cpp-20240722.0/libabsl_strings.a.p/absl_strings_internal_cord_rep_consume.cc.o
[53/363] Compiling C++ object subprojects/abseil-cpp-20240722.0/libabsl_strings.a.p/absl_strings_internal_charconv_bigint.cc.o
[54/363] Linking static target subprojects/abseil-cpp-20240722.0/libabsl_numeric.a
[55/363] Compiling C++ object subprojects/abseil-cpp-20240722.0/libabsl_crc.a.p/absl_crc_internal_crc.cc.o
[56/363] Compiling C++ object subprojects/abseil-cpp-20240722.0/libabsl_debugging.a.p/absl_debugging_internal_vdso_support.cc.o
[57/363] Compiling C++ object subprojects/abseil-cpp-20240722.0/libabsl_base.a.p/absl_base_internal_sysinfo.cc.o
[58/363] Linking static target subprojects/abseil-cpp-20240722.0/libabsl_base.a
[59/363] Compiling C++ object subprojects/abseil-cpp-20240722.0/libabsl_types.a.p/absl_types_bad_optional_access.cc.o
[60/363] Compiling C++ object subprojects/abseil-cpp-20240722.0/libabsl_synchronization.a.p/absl_synchronization_internal_win32_waiter.cc.o
[61/363] Compiling C++ object subprojects/abseil-cpp-20240722.0/libabsl_strings.a.p/absl_strings_str_split.cc.o
[62/363] Compiling C++ object subprojects/abseil-cpp-20240722.0/libabsl_strings.a.p/absl_strings_charconv.cc.o
[63/363] Compiling C++ object subprojects/abseil-cpp-20240722.0/libabsl_strings.a.p/absl_strings_internal_escaping.cc.o
[64/363] Compiling C++ object subprojects/abseil-cpp-20240722.0/libabsl_random.a.p/absl_random_seed_gen_exception.cc.o
[65/363] Compiling C++ object subprojects/abseil-cpp-20240722.0/libabsl_time.a.p/absl_time_internal_cctz_src_time_zone_posix.cc.o
[66/363] Compiling C++ object subprojects/abseil-cpp-20240722.0/libabsl_flags.a.p/absl_flags_internal_commandlineflag.cc.o
[67/363] Compiling C++ object subprojects/abseil-cpp-20240722.0/libabsl_strings.a.p/absl_strings_internal_cord_rep_btree_reader.cc.o
[68/363] Compiling C++ object subprojects/abseil-cpp-20240722.0/libabsl_random.a.p/absl_random_gaussian_distribution.cc.o
[69/363] Compiling C++ object subprojects/abseil-cpp-20240722.0/libabsl_synchronization.a.p/absl_synchronization_internal_per_thread_sem.cc.o
[70/363] Compiling C++ object subprojects/abseil-cpp-20240722.0/libabsl_strings.a.p/absl_strings_substitute.cc.o
[71/363] Compiling C++ object subprojects/abseil-cpp-20240722.0/libabsl_strings.a.p/absl_strings_internal_cord_internal.cc.o
[72/363] Compiling C++ object subprojects/abseil-cpp-20240722.0/libabsl_strings.a.p/absl_strings_cord_analysis.cc.o
[73/363] Compiling C++ object subprojects/abseil-cpp-20240722.0/libabsl_crc.a.p/absl_crc_crc32c.cc.o
[74/363] Compiling C++ object subprojects/abseil-cpp-20240722.0/libabsl_strings.a.p/absl_strings_escaping.cc.o
[75/363] Compiling C++ object subprojects/abseil-cpp-20240722.0/libabsl_crc.a.p/absl_crc_internal_crc_memcpy_fallback.cc.o
[76/363] Compiling C++ object subprojects/abseil-cpp-20240722.0/libabsl_container.a.p/absl_container_internal_hashtablez_sampler_force_weak_definition.cc.o
[77/363] Compiling C++ object subprojects/abseil-cpp-20240722.0/libabsl_strings.a.p/absl_strings_str_replace.cc.o
[78/363] Compiling C++ object subprojects/abseil-cpp-20240722.0/libabsl_strings.a.p/absl_strings_internal_cordz_sample_token.cc.o
[79/363] Compiling C++ object subprojects/abseil-cpp-20240722.0/libabsl_strings.a.p/absl_strings_internal_cord_rep_crc.cc.o
[80/363] Compiling C++ object subprojects/abseil-cpp-20240722.0/libabsl_strings.a.p/absl_strings_internal_str_format_parser.cc.o
[81/363] Compiling C++ object subprojects/abseil-cpp-20240722.0/libabsl_strings.a.p/absl_strings_internal_str_format_bind.cc.o
[82/363] Compiling C++ object subprojects/abseil-cpp-20240722.0/libabsl_strings.a.p/absl_strings_internal_cord_rep_btree.cc.o
[83/363] Compiling C++ object subprojects/abseil-cpp-20240722.0/libabsl_strings.a.p/absl_strings_str_cat.cc.o
[84/363] Compiling C++ object subprojects/abseil-cpp-20240722.0/libabsl_types.a.p/absl_types_bad_variant_access.cc.o
[85/363] Linking static target subprojects/abseil-cpp-20240722.0/libabsl_types.a
[86/363] Compiling C++ object subprojects/abseil-cpp-20240722.0/libabsl_strings.a.p/absl_strings_internal_cordz_handle.cc.o
[87/363] Compiling C++ object subprojects/abseil-cpp-20240722.0/libabsl_random.a.p/absl_random_internal_randen.cc.o
[88/363] Compiling C++ object subprojects/abseil-cpp-20240722.0/libabsl_strings.a.p/absl_strings_numbers.cc.o
[89/363] Compiling C++ object subprojects/abseil-cpp-20240722.0/libabsl_debugging.a.p/absl_debugging_internal_examine_stack.cc.o
[90/363] Compiling C++ object subprojects/abseil-cpp-20240722.0/libabsl_crc.a.p/absl_crc_internal_crc_cord_state.cc.o
[91/363] Compiling C++ object subprojects/abseil-cpp-20240722.0/libabsl_random.a.p/absl_random_discrete_distribution.cc.o
[92/363] Compiling C++ object subprojects/abseil-cpp-20240722.0/libabsl_log.a.p/absl_log_internal_nullguard.cc.o
[93/363] Compiling C++ object subprojects/abseil-cpp-20240722.0/libabsl_random.a.p/absl_random_internal_chi_square.cc.o
[94/363] Compiling C++ object subprojects/abseil-cpp-20240722.0/libabsl_time.a.p/absl_time_time.cc.o
[95/363] Compiling C++ object subprojects/abseil-cpp-20240722.0/libabsl_time.a.p/absl_time_internal_cctz_src_time_zone_fixed.cc.o
[96/363] Compiling C++ object subprojects/abseil-cpp-20240722.0/libabsl_time.a.p/absl_time_internal_cctz_src_zone_info_source.cc.o
[97/363] Compiling C++ object subprojects/abseil-cpp-20240722.0/libabsl_time.a.p/absl_time_internal_cctz_src_time_zone_libc.cc.o
[98/363] Compiling C++ object subprojects/abseil-cpp-20240722.0/libabsl_time.a.p/absl_time_internal_cctz_src_time_zone_format.cc.o
[99/363] Compiling C++ object subprojects/abseil-cpp-20240722.0/libabsl_crc.a.p/absl_crc_internal_crc_non_temporal_memcpy.cc.o
[100/363] Compiling C++ object subprojects/abseil-cpp-20240722.0/libabsl_debugging.a.p/absl_debugging_symbolize.cc.o
[101/363] Linking static target subprojects/abseil-cpp-20240722.0/libabsl_debugging.a
[102/363] Linking static target subprojects/abseil-cpp-20240722.0/libabsl_crc.a
[103/363] Compiling C++ object subprojects/abseil-cpp-20240722.0/libabsl_random.a.p/absl_random_internal_pool_urbg.cc.o
[104/363] Compiling C++ object subprojects/abseil-cpp-20240722.0/libabsl_strings.a.p/absl_strings_internal_str_format_float_conversion.cc.o
[105/363] Compiling C++ object subprojects/abseil-cpp-20240722.0/libabsl_strings.a.p/absl_strings_internal_cordz_info.cc.o
[106/363] Compiling C++ object subprojects/abseil-cpp-20240722.0/libabsl_random.a.p/absl_random_seed_sequences.cc.o
[107/363] Compiling C++ object subprojects/highway/libhwy.a.p/hwy_print.cc.o
In file included from ../../subprojects/highway/hwy/print.h:24,
from ../../subprojects/highway/hwy/print.cc:16:
../../subprojects/highway/hwy/base.h: In static member function ‘static uint64_t hwy::Divisor64::Div128(uint64_t, uint64_t)’:
../../subprojects/highway/hwy/base.h:3060:27: warning: ISO C++ does not support ‘__int128’ for ‘type name’ [-Wpedantic]
3060 | using u128 = unsigned __int128;
| ^~~~~~~~
../../subprojects/highway/hwy/base.h: In static member function ‘static uint64_t hwy::Divisor64::MulHigh(uint64_t, uint64_t)’:
../../subprojects/highway/hwy/base.h:3070:27: warning: ISO C++ does not support ‘__int128’ for ‘type name’ [-Wpedantic]
3070 | using u128 = unsigned __int128;
| ^~~~~~~~
[108/363] Compiling C++ object subprojects/highway/libhwy.a.p/hwy_aligned_allocator.cc.o
In file included from ../../subprojects/highway/hwy/aligned_allocator.h:32,
from ../../subprojects/highway/hwy/aligned_allocator.cc:16:
../../subprojects/highway/hwy/base.h: In static member function ‘static uint64_t hwy::Divisor64::Div128(uint64_t, uint64_t)’:
../../subprojects/highway/hwy/base.h:3060:27: warning: ISO C++ does not support ‘__int128’ for ‘type name’ [-Wpedantic]
3060 | using u128 = unsigned __int128;
| ^~~~~~~~
../../subprojects/highway/hwy/base.h: In static member function ‘static uint64_t hwy::Divisor64::MulHigh(uint64_t, uint64_t)’:
../../subprojects/highway/hwy/base.h:3070:27: warning: ISO C++ does not support ‘__int128’ for ‘type name’ [-Wpedantic]
3070 | using u128 = unsigned __int128;
| ^~~~~~~~
[109/363] Compiling C++ object subprojects/abseil-cpp-20240722.0/libabsl_hash.a.p/absl_hash_internal_hash.cc.o
[110/363] Linking static target subprojects/abseil-cpp-20240722.0/libabsl_hash.a
[111/363] Compiling C++ object subprojects/abseil-cpp-20240722.0/libabsl_random.a.p/absl_random_internal_randen_hwaes.cc.o
[112/363] Compiling C++ object subprojects/abseil-cpp-20240722.0/libabsl_time.a.p/absl_time_clock.cc.o
[113/363] Compiling C++ object subprojects/abseil-cpp-20240722.0/libabsl_random.a.p/absl_random_internal_randen_slow.cc.o
[114/363] Compiling C++ object subprojects/highway/libhwy_contrib.a.p/hwy_contrib_thread_pool_topology.cc.o
../../subprojects/highway/hwy/contrib/thread_pool/topology.cc:970:66: warning: ISO C++11 requires at least one argument for the "..." in a variadic macro
970 | HWY_WARN("no packages, shared cache sizes may be incorrect\n");
| ^
In file included from ../../subprojects/highway/hwy/contrib/thread_pool/topology.h:25,
from ../../subprojects/highway/hwy/contrib/thread_pool/topology.cc:16:
../../subprojects/highway/hwy/base.h: In static member function ‘static uint64_t hwy::Divisor64::Div128(uint64_t, uint64_t)’:
../../subprojects/highway/hwy/base.h:3060:27: warning: ISO C++ does not support ‘__int128’ for ‘type name’ [-Wpedantic]
3060 | using u128 = unsigned __int128;
| ^~~~~~~~
../../subprojects/highway/hwy/base.h: In static member function ‘static uint64_t hwy::Divisor64::MulHigh(uint64_t, uint64_t)’:
../../subprojects/highway/hwy/base.h:3070:27: warning: ISO C++ does not support ‘__int128’ for ‘type name’ [-Wpedantic]
3070 | using u128 = unsigned __int128;
| ^~~~~~~~
[115/363] Compiling C++ object subprojects/abseil-cpp-20240722.0/libabsl_time.a.p/absl_time_internal_cctz_src_time_zone_lookup.cc.o
[116/363] Compiling C++ object subprojects/abseil-cpp-20240722.0/libabsl_synchronization.a.p/absl_synchronization_internal_futex_waiter.cc.o
[117/363] Compiling C++ object subprojects/highway/libhwy.a.p/hwy_perf_counters.cc.o
../../subprojects/highway/hwy/perf_counters.cc:146:58: warning: ISO C++11 requires at least one argument for the "..." in a variadic macro
146 | HWY_WARN("perf_event_open retries were insufficient.");
| ^
../../subprojects/highway/hwy/perf_counters.cc:219:53: warning: ISO C++11 requires at least one argument for the "..." in a variadic macro
219 | "continue, but counters will return zero.");
| ^
../../subprojects/highway/hwy/perf_counters.cc:292:42: warning: ISO C++11 requires at least one argument for the "..." in a variadic macro
292 | HWY_WARN("No valid counters found.");
| ^
In file included from ../../subprojects/highway/hwy/perf_counters.h:23,
from ../../subprojects/highway/hwy/perf_counters.cc:16:
../../subprojects/highway/hwy/base.h: In static member function ‘static uint64_t hwy::Divisor64::Div128(uint64_t, uint64_t)’:
../../subprojects/highway/hwy/base.h:3060:27: warning: ISO C++ does not support ‘__int128’ for ‘type name’ [-Wpedantic]
3060 | using u128 = unsigned __int128;
| ^~~~~~~~
../../subprojects/highway/hwy/base.h: In static member function ‘static uint64_t hwy::Divisor64::MulHigh(uint64_t, uint64_t)’:
../../subprojects/highway/hwy/base.h:3070:27: warning: ISO C++ does not support ‘__int128’ for ‘type name’ [-Wpedantic]
3070 | using u128 = unsigned __int128;
| ^~~~~~~~
[118/363] Compiling C++ object subprojects/abseil-cpp-20240722.0/libabsl_container.a.p/absl_container_internal_raw_hash_set.cc.o
[119/363] Compiling C++ object subprojects/highway/libhwy.a.p/hwy_targets.cc.o
In file included from ../../subprojects/highway/hwy/targets.h:28,
from ../../subprojects/highway/hwy/targets.cc:17:
../../subprojects/highway/hwy/base.h: In static member function ‘static uint64_t hwy::Divisor64::Div128(uint64_t, uint64_t)’:
../../subprojects/highway/hwy/base.h:3060:27: warning: ISO C++ does not support ‘__int128’ for ‘type name’ [-Wpedantic]
3060 | using u128 = unsigned __int128;
| ^~~~~~~~
../../subprojects/highway/hwy/base.h: In static member function ‘static uint64_t hwy::Divisor64::MulHigh(uint64_t, uint64_t)’:
../../subprojects/highway/hwy/base.h:3070:27: warning: ISO C++ does not support ‘__int128’ for ‘type name’ [-Wpedantic]
3070 | using u128 = unsigned __int128;
| ^~~~~~~~
[120/363] Compiling C++ object subprojects/abseil-cpp-20240722.0/libabsl_log.a.p/absl_log_internal_conditions.cc.o
[121/363] Compiling C++ object subprojects/highway/libhwy.a.p/hwy_abort.cc.o
In file included from ../../subprojects/highway/hwy/abort.cc:15:
../../subprojects/highway/hwy/base.h: In static member function ‘static uint64_t hwy::Divisor64::Div128(uint64_t, uint64_t)’:
../../subprojects/highway/hwy/base.h:3060:27: warning: ISO C++ does not support ‘__int128’ for ‘type name’ [-Wpedantic]
3060 | using u128 = unsigned __int128;
| ^~~~~~~~
../../subprojects/highway/hwy/base.h: In static member function ‘static uint64_t hwy::Divisor64::MulHigh(uint64_t, uint64_t)’:
../../subprojects/highway/hwy/base.h:3070:27: warning: ISO C++ does not support ‘__int128’ for ‘type name’ [-Wpedantic]
3070 | using u128 = unsigned __int128;
| ^~~~~~~~
[122/363] Compiling C++ object subprojects/abseil-cpp-20240722.0/libabsl_synchronization.a.p/absl_synchronization_internal_graphcycles.cc.o
[123/363] Compiling C++ object subprojects/abseil-cpp-20240722.0/libabsl_time.a.p/absl_time_internal_cctz_src_time_zone_if.cc.o
[124/363] Compiling C++ object subprojects/abseil-cpp-20240722.0/libabsl_synchronization.a.p/absl_synchronization_internal_create_thread_identity.cc.o
[125/363] Compiling C++ object subprojects/abseil-cpp-20240722.0/libabsl_flags.a.p/absl_flags_internal_private_handle_accessor.cc.o
[126/363] Compiling C++ object subprojects/abseil-cpp-20240722.0/libabsl_synchronization.a.p/absl_synchronization_barrier.cc.o
[127/363] Compiling C++ object subprojects/highway/libhwy_contrib.a.p/hwy_contrib_image_image.cc.o
In file included from ../../subprojects/highway/hwy/aligned_allocator.h:32,
from ../../subprojects/highway/hwy/contrib/image/image.h:25,
from ../../subprojects/highway/hwy/contrib/image/image.cc:16:
../../subprojects/highway/hwy/base.h: In static member function ‘static uint64_t hwy::Divisor64::Div128(uint64_t, uint64_t)’:
../../subprojects/highway/hwy/base.h:3060:27: warning: ISO C++ does not support ‘__int128’ for ‘type name’ [-Wpedantic]
3060 | using u128 = unsigned __int128;
| ^~~~~~~~
../../subprojects/highway/hwy/base.h: In static member function ‘static uint64_t hwy::Divisor64::MulHigh(uint64_t, uint64_t)’:
../../subprojects/highway/hwy/base.h:3070:27: warning: ISO C++ does not support ‘__int128’ for ‘type name’ [-Wpedantic]
3070 | using u128 = unsigned __int128;
| ^~~~~~~~
[128/363] Compiling C++ object subprojects/abseil-cpp-20240722.0/libabsl_random.a.p/absl_random_internal_seed_material.cc.o
[129/363] Linking static target subprojects/abseil-cpp-20240722.0/libabsl_random.a
[130/363] Compiling C++ object subprojects/abseil-cpp-20240722.0/libabsl_synchronization.a.p/absl_synchronization_blocking_counter.cc.o
[131/363] Compiling C++ object subprojects/highway/libhwy.a.p/hwy_profiler.cc.o
In file included from ../../subprojects/highway/hwy/profiler.h:25,
from ../../subprojects/highway/hwy/profiler.cc:16:
../../subprojects/highway/hwy/base.h: In static member function ‘static uint64_t hwy::Divisor64::Div128(uint64_t, uint64_t)’:
../../subprojects/highway/hwy/base.h:3060:27: warning: ISO C++ does not support ‘__int128’ for ‘type name’ [-Wpedantic]
3060 | using u128 = unsigned __int128;
| ^~~~~~~~
../../subprojects/highway/hwy/base.h: In static member function ‘static uint64_t hwy::Divisor64::MulHigh(uint64_t, uint64_t)’:
../../subprojects/highway/hwy/base.h:3070:27: warning: ISO C++ does not support ‘__int128’ for ‘type name’ [-Wpedantic]
3070 | using u128 = unsigned __int128;
| ^~~~~~~~
[132/363] Compiling C++ object subprojects/abseil-cpp-20240722.0/libabsl_time.a.p/absl_time_internal_cctz_src_time_zone_impl.cc.o
[133/363] Compiling C++ object subprojects/highway/libhwy.a.p/hwy_nanobenchmark.cc.o
../../subprojects/highway/hwy/nanobenchmark.cc:81:43: warning: ISO C++11 requires at least one argument for the "..." in a variadic macro
81 | HWY_WARN("estimated duration is 0\n");
| ^
In file included from ../../subprojects/highway/hwy/timer.h:25,
from ../../subprojects/highway/hwy/nanobenchmark.h:52,
from ../../subprojects/highway/hwy/nanobenchmark.cc:16:
../../subprojects/highway/hwy/base.h: In static member function ‘static uint64_t hwy::Divisor64::Div128(uint64_t, uint64_t)’:
../../subprojects/highway/hwy/base.h:3060:27: warning: ISO C++ does not support ‘__int128’ for ‘type name’ [-Wpedantic]
3060 | using u128 = unsigned __int128;
| ^~~~~~~~
../../subprojects/highway/hwy/base.h: In static member function ‘static uint64_t hwy::Divisor64::MulHigh(uint64_t, uint64_t)’:
../../subprojects/highway/hwy/base.h:3070:27: warning: ISO C++ does not support ‘__int128’ for ‘type name’ [-Wpedantic]
3070 | using u128 = unsigned __int128;
| ^~~~~~~~
[134/363] Compiling C++ object subprojects/abseil-cpp-20240722.0/libabsl_time.a.p/absl_time_duration.cc.o
[135/363] Compiling C++ object subprojects/abseil-cpp-20240722.0/libabsl_flags.a.p/absl_flags_commandlineflag.cc.o
[136/363] Compiling C++ object subprojects/abseil-cpp-20240722.0/libabsl_time.a.p/absl_time_format.cc.o
[137/363] Compiling C++ object subprojects/abseil-cpp-20240722.0/libabsl_log.a.p/absl_log_initialize.cc.o
[138/363] Compiling C++ object subprojects/highway/libhwy_contrib.a.p/hwy_contrib_thread_pool_thread_pool.cc.o
In file included from ../../subprojects/highway/hwy/contrib/thread_pool/thread_pool.h:39,
from ../../subprojects/highway/hwy/contrib/thread_pool/thread_pool.cc:16:
../../subprojects/highway/hwy/contrib/thread_pool/spin.h:308:78: warning: ISO C++11 requires at least one argument for the "..." in a variadic macro
308 | HWY_WARN("Ignoring attempt to disable Pause, it is the only option left.");
| ^
In file included from ../../subprojects/highway/hwy/aligned_allocator.h:32,
from ../../subprojects/highway/hwy/contrib/thread_pool/thread_pool.h:34,
from ../../subprojects/highway/hwy/contrib/thread_pool/thread_pool.cc:16:
../../subprojects/highway/hwy/base.h: In static member function ‘static uint64_t hwy::Divisor64::Div128(uint64_t, uint64_t)’:
../../subprojects/highway/hwy/base.h:3060:27: warning: ISO C++ does not support ‘__int128’ for ‘type name’ [-Wpedantic]
3060 | using u128 = unsigned __int128;
| ^~~~~~~~
../../subprojects/highway/hwy/base.h: In static member function ‘static uint64_t hwy::Divisor64::MulHigh(uint64_t, uint64_t)’:
../../subprojects/highway/hwy/base.h:3070:27: warning: ISO C++ does not support ‘__int128’ for ‘type name’ [-Wpedantic]
3070 | using u128 = unsigned __int128;
| ^~~~~~~~
[139/363] Compiling C++ object subprojects/abseil-cpp-20240722.0/libabsl_synchronization.a.p/absl_synchronization_internal_kernel_timeout.cc.o
[140/363] Generating 'lc0.p/proto/onnx.pb.h'
[141/363] Compiling C++ object subprojects/abseil-cpp-20240722.0/libabsl_synchronization.a.p/absl_synchronization_internal_pthread_waiter.cc.o
[142/363] Compiling C++ object subprojects/abseil-cpp-20240722.0/libabsl_time.a.p/absl_time_civil_time.cc.o
[143/363] Compiling C++ object subprojects/abseil-cpp-20240722.0/libabsl_synchronization.a.p/absl_synchronization_internal_sem_waiter.cc.o
[144/363] Compiling C++ object subprojects/abseil-cpp-20240722.0/libabsl_log.a.p/absl_log_internal_fnmatch.cc.o
[145/363] Compiling C++ object subprojects/abseil-cpp-20240722.0/libabsl_synchronization.a.p/absl_synchronization_internal_stdcpp_waiter.cc.o
[146/363] Generating 'engine_test.p/proto/net.pb.h'
[147/363] Generating 'lc0.p/proto/hlo.pb.h'
[148/363] Generating 'liblc0_lib.so.p/proto/net.pb.h'
[149/363] Compiling C++ object subprojects/abseil-cpp-20240722.0/libabsl_flags.a.p/absl_flags_internal_program_name.cc.o
[150/363] Generating 'lc0.p/proto/net.pb.h'
[151/363] Generating 'encoder_test.p/proto/net.pb.h'
[152/363] Compiling C++ object subprojects/abseil-cpp-20240722.0/libabsl_synchronization.a.p/absl_synchronization_notification.cc.o
[153/363] Compiling C++ object subprojects/highway/libhwy.a.p/hwy_timer.cc.o
../../subprojects/highway/hwy/timer.cc:39:71: warning: ISO C++11 requires at least one argument for the "..." in a variadic macro
39 | HWY_WARN("TSC not constant/invariant, may vary frequency or jump.");
| ^
In file included from ../../subprojects/highway/hwy/timer.h:25,
from ../../subprojects/highway/hwy/timer.cc:16:
../../subprojects/highway/hwy/base.h: In static member function ‘static uint64_t hwy::Divisor64::Div128(uint64_t, uint64_t)’:
../../subprojects/highway/hwy/base.h:3060:27: warning: ISO C++ does not support ‘__int128’ for ‘type name’ [-Wpedantic]
3060 | using u128 = unsigned __int128;
| ^~~~~~~~
../../subprojects/highway/hwy/base.h: In static member function ‘static uint64_t hwy::Divisor64::MulHigh(uint64_t, uint64_t)’:
../../subprojects/highway/hwy/base.h:3070:27: warning: ISO C++ does not support ‘__int128’ for ‘type name’ [-Wpedantic]
3070 | using u128 = unsigned __int128;
| ^~~~~~~~
[154/363] Compiling C++ object subprojects/highway/libhwy_contrib.a.p/hwy_contrib_sort_vqsort.cc.o
In file included from ../../subprojects/highway/hwy/contrib/sort/vqsort.h:33,
from ../../subprojects/highway/hwy/contrib/sort/vqsort.cc:16:
../../subprojects/highway/hwy/base.h: In static member function ‘static uint64_t hwy::Divisor64::Div128(uint64_t, uint64_t)’:
../../subprojects/highway/hwy/base.h:3060:27: warning: ISO C++ does not support ‘__int128’ for ‘type name’ [-Wpedantic]
3060 | using u128 = unsigned __int128;
| ^~~~~~~~
../../subprojects/highway/hwy/base.h: In static member function ‘static uint64_t hwy::Divisor64::MulHigh(uint64_t, uint64_t)’:
../../subprojects/highway/hwy/base.h:3070:27: warning: ISO C++ does not support ‘__int128’ for ‘type name’ [-Wpedantic]
3070 | using u128 = unsigned __int128;
| ^~~~~~~~
[155/363] Compiling C++ object subprojects/abseil-cpp-20240722.0/libabsl_log.a.p/absl_log_internal_proto.cc.o
[156/363] Compiling C++ object subprojects/abseil-cpp-20240722.0/libabsl_synchronization.a.p/absl_synchronization_internal_waiter_base.cc.o
[157/363] Compiling C++ object subprojects/abseil-cpp-20240722.0/libabsl_log.a.p/absl_log_log_entry.cc.o
[158/363] Compiling C++ object subprojects/abseil-cpp-20240722.0/libabsl_container.a.p/absl_container_internal_hashtablez_sampler.cc.o
[159/363] Linking static target subprojects/abseil-cpp-20240722.0/libabsl_container.a
[160/363] Compiling C++ object subprojects/abseil-cpp-20240722.0/libabsl_flags.a.p/absl_flags_usage.cc.o
[161/363] Compiling C++ object subprojects/abseil-cpp-20240722.0/libabsl_log.a.p/absl_log_die_if_null.cc.o
[162/363] Compiling C++ object subprojects/abseil-cpp-20240722.0/libabsl_status.a.p/absl_status_status_payload_printer.cc.o
[163/363] Compiling C++ object subprojects/abseil-cpp-20240722.0/libabsl_log.a.p/absl_log_log_sink.cc.o
[164/363] Compiling C++ object subprojects/abseil-cpp-20240722.0/libabsl_strings.a.p/absl_strings_cord.cc.o
[165/363] Linking static target subprojects/abseil-cpp-20240722.0/libabsl_strings.a
[166/363] Compiling C++ object subprojects/abseil-cpp-20240722.0/libabsl_flags.a.p/absl_flags_internal_usage.cc.o
[167/363] Compiling C++ object subprojects/abseil-cpp-20240722.0/libabsl_log.a.p/absl_log_internal_log_format.cc.o
[168/363] Compiling C++ object subprojects/abseil-cpp-20240722.0/libabsl_log.a.p/absl_log_flags.cc.o
[169/363] Compiling C++ object subprojects/abseil-cpp-20240722.0/libabsl_log.a.p/absl_log_internal_globals.cc.o
[170/363] Compiling C++ object subprojects/abseil-cpp-20240722.0/libabsl_log.a.p/absl_log_internal_log_sink_set.cc.o
[171/363] Compiling C++ object subprojects/abseil-cpp-20240722.0/libabsl_flags.a.p/absl_flags_usage_config.cc.o
[172/363] Compiling C++ object subprojects/abseil-cpp-20240722.0/libabsl_log.a.p/absl_log_internal_check_op.cc.o
[173/363] Compiling C++ object subprojects/abseil-cpp-20240722.0/libabsl_status.a.p/absl_status_status.cc.o
[174/363] Compiling C++ object subprojects/abseil-cpp-20240722.0/libabsl_flags.a.p/absl_flags_internal_flag.cc.o
[175/363] Compiling C++ object subprojects/abseil-cpp-20240722.0/libabsl_log.a.p/absl_log_globals.cc.o
[176/363] Compiling C++ object subprojects/abseil-cpp-20240722.0/libabsl_time.a.p/absl_time_internal_cctz_src_time_zone_info.cc.o
[177/363] Linking static target subprojects/abseil-cpp-20240722.0/libabsl_time.a
[178/363] Compiling C++ object subprojects/abseil-cpp-20240722.0/libabsl_log.a.p/absl_log_internal_vlog_config.cc.o
[179/363] Compiling C++ object subprojects/abseil-cpp-20240722.0/libabsl_flags.a.p/absl_flags_marshalling.cc.o
[180/363] Compiling C++ object subprojects/abseil-cpp-20240722.0/libabsl_synchronization.a.p/absl_synchronization_mutex.cc.o
[181/363] Linking static target subprojects/abseil-cpp-20240722.0/libabsl_synchronization.a
[182/363] Compiling C++ object subprojects/abseil-cpp-20240722.0/libabsl_log.a.p/absl_log_internal_log_message.cc.o
[183/363] Linking static target subprojects/abseil-cpp-20240722.0/libabsl_log.a
[184/363] Compiling C++ object subprojects/abseil-cpp-20240722.0/libabsl_status.a.p/absl_status_internal_status_internal.cc.o
[185/363] Compiling C++ object liblc0_lib.so.p/src_utils_protomessage.cc.o
[186/363] Compiling C++ object liblc0_lib.so.p/src_chess_gamestate.cc.o
[187/363] Compiling C++ object subprojects/abseil-cpp-20240722.0/libabsl_status.a.p/absl_status_statusor.cc.o
[188/363] Linking static target subprojects/abseil-cpp-20240722.0/libabsl_status.a
[189/363] Compiling C++ object lc0.p/src_search_classic_stoppers_factory.cc.o
[190/363] Compiling C++ object lc0.p/src_neural_xla_xla_tensor.cc.o
[191/363] Compiling C++ object lc0.p/src_utils_protomessage.cc.o
[192/363] Compiling C++ object lc0.p/src_search_classic_stoppers_alphazero.cc.o
[193/363] Compiling C++ object subprojects/abseil-cpp-20240722.0/libabsl_flags.a.p/absl_flags_parse.cc.o
[194/363] Compiling C++ object lc0.p/src_search_classic_stoppers_simple.cc.o
[195/363] Compiling C++ object lc0.p/src_search_classic_stoppers_smooth.cc.o
[196/363] Compiling C++ object liblc0_lib.so.p/src_neural_batchsplit.cc.o
[197/363] Compiling C++ object liblc0_lib.so.p/src_chess_uciloop.cc.o
[198/363] Compiling C++ object lc0.p/src_chess_board.cc.o
[199/363] Compiling C++ object lc0.p/src_neural_xla_print_hlo.cc.o
[200/363] Compiling C++ object subprojects/abseil-cpp-20240722.0/libabsl_flags.a.p/absl_flags_reflection.cc.o
[201/363] Linking static target subprojects/abseil-cpp-20240722.0/libabsl_flags.a
[202/363] Compiling C++ object lc0.p/src_main.cc.o
[203/363] Compiling C++ object lc0.p/src_search_classic_stoppers_timemgr.cc.o
[204/363] Compiling C++ object lc0.p/src_neural_onnx_adapters.cc.o
[205/363] Compiling C++ object lc0.p/src_neural_onnx_builder.cc.o
[206/363] Compiling C++ object lc0.p/src_search_classic_stoppers_legacy.cc.o
[207/363] Compiling C++ object lc0.p/src_search_classic_search.cc.o
[208/363] Compiling C++ object lc0.p/src_search_register.cc.o
[209/363] Compiling C++ object liblc0_lib.so.p/src_neural_backend.cc.o
[210/363] Compiling C++ object lc0.p/src_utils_histogram.cc.o
[211/363] Compiling C++ object subprojects/highway/libhwy_contrib.a.p/hwy_contrib_sort_vqsort_i64d.cc.o
In file included from ../../subprojects/highway/hwy/contrib/sort/vqsort.h:33,
from ../../subprojects/highway/hwy/contrib/sort/vqsort_i64d.cc:16:
../../subprojects/highway/hwy/base.h: In static member function ‘static uint64_t hwy::Divisor64::Div128(uint64_t, uint64_t)’:
../../subprojects/highway/hwy/base.h:3060:27: warning: ISO C++ does not support ‘__int128’ for ‘type name’ [-Wpedantic]
3060 | using u128 = unsigned __int128;
| ^~~~~~~~
../../subprojects/highway/hwy/base.h: In static member function ‘static uint64_t hwy::Divisor64::MulHigh(uint64_t, uint64_t)’:
../../subprojects/highway/hwy/base.h:3070:27: warning: ISO C++ does not support ‘__int128’ for ‘type name’ [-Wpedantic]
3070 | using u128 = unsigned __int128;
| ^~~~~~~~
[212/363] Compiling C++ object lc0.p/src_neural_onnx_converter.cc.o
[213/363] Compiling C++ object lc0.p/src_search_classic_stoppers_common.cc.o
[214/363] Compiling C++ object lc0.p/src_neural_backends_network_rr.cc.o
[215/363] Compiling C++ object lc0.p/src_neural_backends_network_mux.cc.o
[216/363] Compiling C++ object lc0.p/src_neural_backends_network_record.cc.o
[217/363] Compiling C++ object lc0.p/src_neural_backends_blas_se_unit.cc.o
[218/363] Compiling C++ object lc0.p/src_search_classic_stoppers_stoppers.cc.o
[219/363] Compiling C++ object lc0.p/src_neural_network_legacy.cc.o
[220/363] Compiling C++ object lc0.p/src_neural_backends_shared_winograd_filter.cc.o
[221/363] Compiling C++ object lc0.p/src_engine_loop.cc.o
[222/363] Compiling C++ object lc0.p/src_utils_backtrace.cc.o
FAILED: lc0.p/src_utils_backtrace.cc.o
c++ -Ilc0.p -I. -I../.. -I../../src -I../../src/neural/backends/cuda -Isubprojects/abseil-cpp-20240722.0 -I../../subprojects/abseil-cpp-20240722.0 -I/usr/include/x86_64-linux-gnu -flto=auto -fdiagnostics-color=always -D_GLIBCXX_ASSERTIONS=1 -D_FILE_OFFSET_BITS=64 -Wall -Winvalid-pch -Wextra -Wpedantic -std=c++20 -O2 -g -DUSE_OPENBLAS -DUSE_BLAS -DUSE_CUTLASS -DNO_PEXT -DEMBED -pthread -isystem../../subprojects/eigen-3.4.0 -isystemsubprojects/eigen-3.4.0 -isystem../../subprojects/highway -isystemsubprojects/highway -isystem../../subprojects/abseil-cpp-20240722.0 -isystemsubprojects/abseil-cpp-20240722.0 -isystem/usr/local/cuda/include -isystem../../third_party -MD -MQ lc0.p/src_utils_backtrace.cc.o -MF lc0.p/src_utils_backtrace.cc.o.d -o lc0.p/src_utils_backtrace.cc.o -c ../../src/utils/backtrace.cc
../../src/utils/backtrace.cc: In member function ‘void lczero::{anonymous}::BacktraceSignalHandler::BacktracePrinterThread::Run()’:
../../src/utils/backtrace.cc:132:15: error: ‘unw_get_proc_name_by_ip’ was not declared in this scope; did you mean ‘unw_get_proc_info_by_ip’?
132 | unw_get_proc_name_by_ip(unw_local_addr_space, ip, symbols.data(),
| ^~~~~~~~~~~~~~~~~~~~~~~
| unw_get_proc_info_by_ip
../../src/utils/backtrace.cc: In static member function ‘static void lczero::{anonymous}::BacktraceSignalHandler::HandleSignal(int, siginfo_t*, void*)’:
../../src/utils/backtrace.cc:184:12: warning: ignoring return value of ‘ssize_t write(int, const void*, size_t)’ declared with attribute ‘warn_unused_result’ [-Wunused-result]
184 | write(STDERR_FILENO, message.data(), message.size());
| ~~~~~^~~~~~~~~~~~~~~~~~~~~~~~~~~~~~~~~~~~~~~~~~~~~~~
../../src/utils/backtrace.cc:194:12: warning: ignoring return value of ‘ssize_t write(int, const void*, size_t)’ declared with attribute ‘warn_unused_result’ [-Wunused-result]
194 | write(STDERR_FILENO, message, sizeof(message) - 1);
| ~~~~~^~~~~~~~~~~~~~~~~~~~~~~~~~~~~~~~~~~~~~~~~~~~~
../../src/utils/backtrace.cc:205:14: warning: ignoring return value of ‘ssize_t write(int, const void*, size_t)’ declared with attribute ‘warn_unused_result’ [-Wunused-result]
205 | write(STDERR_FILENO, message, sizeof(message) - 1);
| ~~~~~^~~~~~~~~~~~~~~~~~~~~~~~~~~~~~~~~~~~~~~~~~~~~
../../src/utils/backtrace.cc:219:12: warning: ignoring return value of ‘ssize_t write(int, const void*, size_t)’ declared with attribute ‘warn_unused_result’ [-Wunused-result]
219 | write(STDERR_FILENO, message.data(), len);
| ~~~~~^~~~~~~~~~~~~~~~~~~~~~~~~~~~~~~~~~~~
[223/363] Compiling C++ object lc0.p/src_neural_backends_network_check.cc.o
[224/363] Compiling C++ object subprojects/highway/libhwy.a.p/hwy_per_target.cc.o
In file included from ../../subprojects/highway/hwy/highway.h:19,
from ../../subprojects/highway/hwy/per_target.cc:28,
from ../../subprojects/highway/hwy/foreach_target.h:72,
from ../../subprojects/highway/hwy/per_target.cc:27:
../../subprojects/highway/hwy/base.h: In static member function ‘static uint64_t hwy::Divisor64::Div128(uint64_t, uint64_t)’:
../../subprojects/highway/hwy/base.h:3060:27: warning: ISO C++ does not support ‘__int128’ for ‘type name’ [-Wpedantic]
3060 | using u128 = unsigned __int128;
| ^~~~~~~~
../../subprojects/highway/hwy/base.h: In static member function ‘static uint64_t hwy::Divisor64::MulHigh(uint64_t, uint64_t)’:
../../subprojects/highway/hwy/base.h:3070:27: warning: ISO C++ does not support ‘__int128’ for ‘type name’ [-Wpedantic]
3070 | using u128 = unsigned __int128;
| ^~~~~~~~
[225/363] Compiling C++ object lc0.p/src_selfplay_multigame.cc.o
[226/363] Compiling C++ object lc0.p/src_engine.cc.o
[227/363] Compiling C++ object lc0.p/src_selfplay_tournament.cc.o
[228/363] Compiling C++ object lc0.p/src_neural_backends_blas_fully_connected_layer.cc.o
[229/363] Compiling C++ object lc0.p/src_neural_xla_hlo_builder.cc.o
[230/363] Compiling C++ object lc0.p/src_neural_backends_network_random.cc.o
[231/363] Compiling C++ object lc0.p/src_search_classic_wrapper.cc.o
[232/363] Compiling C++ object lc0.p/src_neural_memcache.cc.o
[233/363] Compiling C++ object lc0.p/src_search_classic_params.cc.o
[234/363] Compiling C++ object lc0.p/src_tools_benchmark.cc.o
[235/363] Compiling C++ object lc0.p/src_chess_gamestate.cc.o
[236/363] Compiling C++ object lc0.p/src_neural_backends_shared_activation.cc.o
[237/363] Compiling C++ object lc0.p/src_chess_position.cc.o
[238/363] Compiling C++ object lc0.p/src_neural_backends_network_trivial.cc.o
[239/363] Compiling C++ object lc0.p/src_selfplay_game.cc.o
[240/363] Compiling C++ object lc0.p/src_selfplay_loop.cc.o
[241/363] Compiling C++ object lc0.p/src_utils_numa.cc.o
../../src/utils/numa.cc: In static member function ‘static void lczero::Numa::BindThreadToNode(int)’:
../../src/utils/numa.cc:767:33: warning: unused parameter ‘node_id’ [-Wunused-parameter]
767 | void Numa::BindThreadToNode(int node_id) {
| ~~~~^~~~~~~
../../src/utils/numa.cc: In static member function ‘static void lczero::Numa::BindThreadToCudaDevice(int)’:
../../src/utils/numa.cc:782:39: warning: unused parameter ‘device_id’ [-Wunused-parameter]
782 | void Numa::BindThreadToCudaDevice(int device_id) {
| ~~~~^~~~~~~~~
[242/363] Compiling C++ object subprojects/highway/libhwy_contrib.a.p/hwy_contrib_sort_vqsort_f16a.cc.o
In file included from ../../subprojects/highway/hwy/contrib/sort/vqsort.h:33,
from ../../subprojects/highway/hwy/contrib/sort/vqsort_f16a.cc:16:
../../subprojects/highway/hwy/base.h: In static member function ‘static uint64_t hwy::Divisor64::Div128(uint64_t, uint64_t)’:
../../subprojects/highway/hwy/base.h:3060:27: warning: ISO C++ does not support ‘__int128’ for ‘type name’ [-Wpedantic]
3060 | using u128 = unsigned __int128;
| ^~~~~~~~
../../subprojects/highway/hwy/base.h: In static member function ‘static uint64_t hwy::Divisor64::MulHigh(uint64_t, uint64_t)’:
../../subprojects/highway/hwy/base.h:3070:27: warning: ISO C++ does not support ‘__int128’ for ‘type name’ [-Wpedantic]
3070 | using u128 = unsigned __int128;
| ^~~~~~~~
[243/363] Compiling C++ object lc0.p/src_search_instamove_instamove.cc.o
[244/363] Compiling C++ object lc0.p/src_neural_backends_blas_convolution1.cc.o
[245/363] Compiling C++ object subprojects/highway/libhwy_contrib.a.p/hwy_contrib_sort_vqsort_f32a.cc.o
In file included from ../../subprojects/highway/hwy/contrib/sort/vqsort.h:33,
from ../../subprojects/highway/hwy/contrib/sort/vqsort_f32a.cc:16:
../../subprojects/highway/hwy/base.h: In static member function ‘static uint64_t hwy::Divisor64::Div128(uint64_t, uint64_t)’:
../../subprojects/highway/hwy/base.h:3060:27: warning: ISO C++ does not support ‘__int128’ for ‘type name’ [-Wpedantic]
3060 | using u128 = unsigned __int128;
| ^~~~~~~~
../../subprojects/highway/hwy/base.h: In static member function ‘static uint64_t hwy::Divisor64::MulHigh(uint64_t, uint64_t)’:
../../subprojects/highway/hwy/base.h:3070:27: warning: ISO C++ does not support ‘__int128’ for ‘type name’ [-Wpedantic]
3070 | using u128 = unsigned __int128;
| ^~~~~~~~
[246/363] Compiling C++ object lc0.p/src_neural_backends_network_demux.cc.o
[247/363] Compiling C++ object lc0.p/src_tools_describenet.cc.o
[248/363] Compiling C++ object lc0.p/src_tools_leela2onnx.cc.o
[249/363] Compiling C++ object lc0.p/src_tools_backendbench.cc.o
[250/363] Compiling C++ object lc0.p/src_utils_weights_adapter.cc.o
[251/363] Compiling C++ object lc0.p/src_neural_backends_cuda_network_cuda.cc.o
[252/363] Compiling C++ object lc0.p/src_neural_backends_cuda_layers.cc.o
[253/363] Compiling C++ object lc0.p/src_chess_uciloop.cc.o
[254/363] Compiling C++ object subprojects/highway/libhwy_contrib.a.p/hwy_contrib_sort_vqsort_f16d.cc.o
In file included from ../../subprojects/highway/hwy/contrib/sort/vqsort.h:33,
from ../../subprojects/highway/hwy/contrib/sort/vqsort_f16d.cc:16:
../../subprojects/highway/hwy/base.h: In static member function ‘static uint64_t hwy::Divisor64::Div128(uint64_t, uint64_t)’:
../../subprojects/highway/hwy/base.h:3060:27: warning: ISO C++ does not support ‘__int128’ for ‘type name’ [-Wpedantic]
3060 | using u128 = unsigned __int128;
| ^~~~~~~~
../../subprojects/highway/hwy/base.h: In static member function ‘static uint64_t hwy::Divisor64::MulHigh(uint64_t, uint64_t)’:
../../subprojects/highway/hwy/base.h:3070:27: warning: ISO C++ does not support ‘__int128’ for ‘type name’ [-Wpedantic]
3070 | using u128 = unsigned __int128;
| ^~~~~~~~
[255/363] Compiling C++ object subprojects/highway/libhwy_contrib.a.p/hwy_contrib_sort_vqsort_kv128a.cc.o
In file included from ../../subprojects/highway/hwy/contrib/sort/vqsort.h:33,
from ../../subprojects/highway/hwy/contrib/sort/vqsort_kv128a.cc:16:
../../subprojects/highway/hwy/base.h: In static member function ‘static uint64_t hwy::Divisor64::Div128(uint64_t, uint64_t)’:
../../subprojects/highway/hwy/base.h:3060:27: warning: ISO C++ does not support ‘__int128’ for ‘type name’ [-Wpedantic]
3060 | using u128 = unsigned __int128;
| ^~~~~~~~
../../subprojects/highway/hwy/base.h: In static member function ‘static uint64_t hwy::Divisor64::MulHigh(uint64_t, uint64_t)’:
../../subprojects/highway/hwy/base.h:3070:27: warning: ISO C++ does not support ‘__int128’ for ‘type name’ [-Wpedantic]
3070 | using u128 = unsigned __int128;
| ^~~~~~~~
[256/363] Compiling C++ object lc0.p/src_search_dag_classic_params.cc.o
[257/363] Compiling C++ object lc0.p/src_neural_backends_blas_winograd_convolution3.cc.o
[258/363] Compiling C++ object lc0.p/src_search_dag_classic_wrapper.cc.o
In file included from ../../src/search/dag_classic/wrapper.cc:32:
../../src/search/dag_classic/search.h:55:32: warning: unknown option after ‘#pragma GCC diagnostic’ kind [-Wpragmas]
55 | #pragma GCC diagnostic ignored "-Winterference-size"
| ^~~~~~~~~~~~~~~~~~~~~
[259/363] Compiling C++ object lc0.p/src_neural_batchsplit.cc.o
[260/363] Compiling C++ object lc0.p/src_neural_backend.cc.o
[261/363] Compiling C++ object lc0.p/src_tools_onnx2leela.cc.o
[262/363] Compiling C++ object subprojects/highway/libhwy_contrib.a.p/hwy_contrib_sort_vqsort_i32d.cc.o
In file included from ../../subprojects/highway/hwy/contrib/sort/vqsort.h:33,
from ../../subprojects/highway/hwy/contrib/sort/vqsort_i32d.cc:16:
../../subprojects/highway/hwy/base.h: In static member function ‘static uint64_t hwy::Divisor64::Div128(uint64_t, uint64_t)’:
../../subprojects/highway/hwy/base.h:3060:27: warning: ISO C++ does not support ‘__int128’ for ‘type name’ [-Wpedantic]
3060 | using u128 = unsigned __int128;
| ^~~~~~~~
../../subprojects/highway/hwy/base.h: In static member function ‘static uint64_t hwy::Divisor64::MulHigh(uint64_t, uint64_t)’:
../../subprojects/highway/hwy/base.h:3070:27: warning: ISO C++ does not support ‘__int128’ for ‘type name’ [-Wpedantic]
3070 | using u128 = unsigned __int128;
| ^~~~~~~~
[263/363] Compiling C++ object lc0.p/src_search_dag_classic_search.cc.o
In file included from ../../src/search/dag_classic/search.cc:28:
../../src/search/dag_classic/search.h:55:32: warning: unknown option after ‘#pragma GCC diagnostic’ kind [-Wpragmas]
55 | #pragma GCC diagnostic ignored "-Winterference-size"
| ^~~~~~~~~~~~~~~~~~~~~
[264/363] Compiling C++ object subprojects/highway/libhwy_contrib.a.p/hwy_contrib_sort_vqsort_u64a.cc.o
In file included from ../../subprojects/highway/hwy/contrib/sort/vqsort.h:33,
from ../../subprojects/highway/hwy/contrib/sort/vqsort_u64a.cc:16:
../../subprojects/highway/hwy/base.h: In static member function ‘static uint64_t hwy::Divisor64::Div128(uint64_t, uint64_t)’:
../../subprojects/highway/hwy/base.h:3060:27: warning: ISO C++ does not support ‘__int128’ for ‘type name’ [-Wpedantic]
3060 | using u128 = unsigned __int128;
| ^~~~~~~~
../../subprojects/highway/hwy/base.h: In static member function ‘static uint64_t hwy::Divisor64::MulHigh(uint64_t, uint64_t)’:
../../subprojects/highway/hwy/base.h:3070:27: warning: ISO C++ does not support ‘__int128’ for ‘type name’ [-Wpedantic]
3070 | using u128 = unsigned __int128;
| ^~~~~~~~
[265/363] Compiling C++ object subprojects/highway/libhwy_contrib.a.p/hwy_contrib_sort_vqsort_i16a.cc.o
In file included from ../../subprojects/highway/hwy/contrib/sort/vqsort.h:33,
from ../../subprojects/highway/hwy/contrib/sort/vqsort_i16a.cc:16:
../../subprojects/highway/hwy/base.h: In static member function ‘static uint64_t hwy::Divisor64::Div128(uint64_t, uint64_t)’:
../../subprojects/highway/hwy/base.h:3060:27: warning: ISO C++ does not support ‘__int128’ for ‘type name’ [-Wpedantic]
3060 | using u128 = unsigned __int128;
| ^~~~~~~~
../../subprojects/highway/hwy/base.h: In static member function ‘static uint64_t hwy::Divisor64::MulHigh(uint64_t, uint64_t)’:
../../subprojects/highway/hwy/base.h:3070:27: warning: ISO C++ does not support ‘__int128’ for ‘type name’ [-Wpedantic]
3070 | using u128 = unsigned __int128;
| ^~~~~~~~
[266/363] Compiling C++ object lc0.p/src_neural_xla_onnx2hlo.cc.o
[267/363] Compiling C++ object subprojects/highway/libhwy_contrib.a.p/hwy_contrib_sort_vqsort_u16d.cc.o
In file included from ../../subprojects/highway/hwy/contrib/sort/vqsort.h:33,
from ../../subprojects/highway/hwy/contrib/sort/vqsort_u16d.cc:16:
../../subprojects/highway/hwy/base.h: In static member function ‘static uint64_t hwy::Divisor64::Div128(uint64_t, uint64_t)’:
../../subprojects/highway/hwy/base.h:3060:27: warning: ISO C++ does not support ‘__int128’ for ‘type name’ [-Wpedantic]
3060 | using u128 = unsigned __int128;
| ^~~~~~~~
../../subprojects/highway/hwy/base.h: In static member function ‘static uint64_t hwy::Divisor64::MulHigh(uint64_t, uint64_t)’:
../../subprojects/highway/hwy/base.h:3070:27: warning: ISO C++ does not support ‘__int128’ for ‘type name’ [-Wpedantic]
3070 | using u128 = unsigned __int128;
| ^~~~~~~~
[268/363] Compiling C++ object lc0.p/src_search_dag_classic_node.cc.o
In file included from ../../src/search/dag_classic/node.cc:41:
../../src/search/dag_classic/search.h:55:32: warning: unknown option after ‘#pragma GCC diagnostic’ kind [-Wpragmas]
55 | #pragma GCC diagnostic ignored "-Winterference-size"
| ^~~~~~~~~~~~~~~~~~~~~
[269/363] Compiling C++ object subprojects/highway/libhwy_contrib.a.p/hwy_contrib_sort_vqsort_f32d.cc.o
In file included from ../../subprojects/highway/hwy/contrib/sort/vqsort.h:33,
from ../../subprojects/highway/hwy/contrib/sort/vqsort_f32d.cc:16:
../../subprojects/highway/hwy/base.h: In static member function ‘static uint64_t hwy::Divisor64::Div128(uint64_t, uint64_t)’:
../../subprojects/highway/hwy/base.h:3060:27: warning: ISO C++ does not support ‘__int128’ for ‘type name’ [-Wpedantic]
3060 | using u128 = unsigned __int128;
| ^~~~~~~~
../../subprojects/highway/hwy/base.h: In static member function ‘static uint64_t hwy::Divisor64::MulHigh(uint64_t, uint64_t)’:
../../subprojects/highway/hwy/base.h:3070:27: warning: ISO C++ does not support ‘__int128’ for ‘type name’ [-Wpedantic]
3070 | using u128 = unsigned __int128;
| ^~~~~~~~
[270/363] Compiling C++ object subprojects/highway/libhwy_contrib.a.p/hwy_contrib_sort_vqsort_f64d.cc.o
In file included from ../../subprojects/highway/hwy/contrib/sort/vqsort.h:33,
from ../../subprojects/highway/hwy/contrib/sort/vqsort_f64d.cc:16:
../../subprojects/highway/hwy/base.h: In static member function ‘static uint64_t hwy::Divisor64::Div128(uint64_t, uint64_t)’:
../../subprojects/highway/hwy/base.h:3060:27: warning: ISO C++ does not support ‘__int128’ for ‘type name’ [-Wpedantic]
3060 | using u128 = unsigned __int128;
| ^~~~~~~~
../../subprojects/highway/hwy/base.h: In static member function ‘static uint64_t hwy::Divisor64::MulHigh(uint64_t, uint64_t)’:
../../subprojects/highway/hwy/base.h:3070:27: warning: ISO C++ does not support ‘__int128’ for ‘type name’ [-Wpedantic]
3070 | using u128 = unsigned __int128;
| ^~~~~~~~
[271/363] Compiling C++ object subprojects/highway/libhwy_contrib.a.p/hwy_contrib_sort_vqsort_128a.cc.o
In file included from ../../subprojects/highway/hwy/contrib/sort/vqsort.h:33,
from ../../subprojects/highway/hwy/contrib/sort/vqsort_128a.cc:16:
../../subprojects/highway/hwy/base.h: In static member function ‘static uint64_t hwy::Divisor64::Div128(uint64_t, uint64_t)’:
../../subprojects/highway/hwy/base.h:3060:27: warning: ISO C++ does not support ‘__int128’ for ‘type name’ [-Wpedantic]
3060 | using u128 = unsigned __int128;
| ^~~~~~~~
../../subprojects/highway/hwy/base.h: In static member function ‘static uint64_t hwy::Divisor64::MulHigh(uint64_t, uint64_t)’:
../../subprojects/highway/hwy/base.h:3070:27: warning: ISO C++ does not support ‘__int128’ for ‘type name’ [-Wpedantic]
3070 | using u128 = unsigned __int128;
| ^~~~~~~~
[272/363] Compiling C++ object subprojects/highway/libhwy_contrib.a.p/hwy_contrib_sort_vqsort_kv64d.cc.o
In file included from ../../subprojects/highway/hwy/contrib/sort/vqsort.h:33,
from ../../subprojects/highway/hwy/contrib/sort/vqsort_kv64d.cc:16:
../../subprojects/highway/hwy/base.h: In static member function ‘static uint64_t hwy::Divisor64::Div128(uint64_t, uint64_t)’:
../../subprojects/highway/hwy/base.h:3060:27: warning: ISO C++ does not support ‘__int128’ for ‘type name’ [-Wpedantic]
3060 | using u128 = unsigned __int128;
| ^~~~~~~~
../../subprojects/highway/hwy/base.h: In static member function ‘static uint64_t hwy::Divisor64::MulHigh(uint64_t, uint64_t)’:
../../subprojects/highway/hwy/base.h:3070:27: warning: ISO C++ does not support ‘__int128’ for ‘type name’ [-Wpedantic]
3070 | using u128 = unsigned __int128;
| ^~~~~~~~
[273/363] Compiling C++ object subprojects/highway/libhwy_contrib.a.p/hwy_contrib_sort_vqsort_kv128d.cc.o
In file included from ../../subprojects/highway/hwy/contrib/sort/vqsort.h:33,
from ../../subprojects/highway/hwy/contrib/sort/vqsort_kv128d.cc:16:
../../subprojects/highway/hwy/base.h: In static member function ‘static uint64_t hwy::Divisor64::Div128(uint64_t, uint64_t)’:
../../subprojects/highway/hwy/base.h:3060:27: warning: ISO C++ does not support ‘__int128’ for ‘type name’ [-Wpedantic]
3060 | using u128 = unsigned __int128;
| ^~~~~~~~
../../subprojects/highway/hwy/base.h: In static member function ‘static uint64_t hwy::Divisor64::MulHigh(uint64_t, uint64_t)’:
../../subprojects/highway/hwy/base.h:3070:27: warning: ISO C++ does not support ‘__int128’ for ‘type name’ [-Wpedantic]
3070 | using u128 = unsigned __int128;
| ^~~~~~~~
[274/363] Compiling C++ object subprojects/highway/libhwy_contrib.a.p/hwy_contrib_sort_vqsort_u64d.cc.o
In file included from ../../subprojects/highway/hwy/contrib/sort/vqsort.h:33,
from ../../subprojects/highway/hwy/contrib/sort/vqsort_u64d.cc:16:
../../subprojects/highway/hwy/base.h: In static member function ‘static uint64_t hwy::Divisor64::Div128(uint64_t, uint64_t)’:
../../subprojects/highway/hwy/base.h:3060:27: warning: ISO C++ does not support ‘__int128’ for ‘type name’ [-Wpedantic]
3060 | using u128 = unsigned __int128;
| ^~~~~~~~
../../subprojects/highway/hwy/base.h: In static member function ‘static uint64_t hwy::Divisor64::MulHigh(uint64_t, uint64_t)’:
../../subprojects/highway/hwy/base.h:3070:27: warning: ISO C++ does not support ‘__int128’ for ‘type name’ [-Wpedantic]
3070 | using u128 = unsigned __int128;
| ^~~~~~~~
[275/363] Compiling C++ object subprojects/highway/libhwy_contrib.a.p/hwy_contrib_sort_vqsort_f64a.cc.o
In file included from ../../subprojects/highway/hwy/contrib/sort/vqsort.h:33,
from ../../subprojects/highway/hwy/contrib/sort/vqsort_f64a.cc:16:
../../subprojects/highway/hwy/base.h: In static member function ‘static uint64_t hwy::Divisor64::Div128(uint64_t, uint64_t)’:
../../subprojects/highway/hwy/base.h:3060:27: warning: ISO C++ does not support ‘__int128’ for ‘type name’ [-Wpedantic]
3060 | using u128 = unsigned __int128;
| ^~~~~~~~
../../subprojects/highway/hwy/base.h: In static member function ‘static uint64_t hwy::Divisor64::MulHigh(uint64_t, uint64_t)’:
../../subprojects/highway/hwy/base.h:3070:27: warning: ISO C++ does not support ‘__int128’ for ‘type name’ [-Wpedantic]
3070 | using u128 = unsigned __int128;
| ^~~~~~~~
[276/363] Compiling C++ object subprojects/highway/libhwy_contrib.a.p/hwy_contrib_sort_vqsort_kv64a.cc.o
In file included from ../../subprojects/highway/hwy/contrib/sort/vqsort.h:33,
from ../../subprojects/highway/hwy/contrib/sort/vqsort_kv64a.cc:16:
../../subprojects/highway/hwy/base.h: In static member function ‘static uint64_t hwy::Divisor64::Div128(uint64_t, uint64_t)’:
../../subprojects/highway/hwy/base.h:3060:27: warning: ISO C++ does not support ‘__int128’ for ‘type name’ [-Wpedantic]
3060 | using u128 = unsigned __int128;
| ^~~~~~~~
../../subprojects/highway/hwy/base.h: In static member function ‘static uint64_t hwy::Divisor64::MulHigh(uint64_t, uint64_t)’:
../../subprojects/highway/hwy/base.h:3070:27: warning: ISO C++ does not support ‘__int128’ for ‘type name’ [-Wpedantic]
3070 | using u128 = unsigned __int128;
| ^~~~~~~~
[277/363] Generating cuda cutlass code with a custom command
[278/363] Compiling C++ object subprojects/highway/libhwy_contrib.a.p/hwy_contrib_sort_vqsort_u32d.cc.o
In file included from ../../subprojects/highway/hwy/contrib/sort/vqsort.h:33,
from ../../subprojects/highway/hwy/contrib/sort/vqsort_u32d.cc:16:
../../subprojects/highway/hwy/base.h: In static member function ‘static uint64_t hwy::Divisor64::Div128(uint64_t, uint64_t)’:
../../subprojects/highway/hwy/base.h:3060:27: warning: ISO C++ does not support ‘__int128’ for ‘type name’ [-Wpedantic]
3060 | using u128 = unsigned __int128;
| ^~~~~~~~
../../subprojects/highway/hwy/base.h: In static member function ‘static uint64_t hwy::Divisor64::MulHigh(uint64_t, uint64_t)’:
../../subprojects/highway/hwy/base.h:3070:27: warning: ISO C++ does not support ‘__int128’ for ‘type name’ [-Wpedantic]
3070 | using u128 = unsigned __int128;
| ^~~~~~~~
[279/363] Compiling C++ object lc0.p/src_neural_backends_blas_network_blas.cc.o
[280/363] Compiling C++ object subprojects/highway/libhwy_contrib.a.p/hwy_contrib_sort_vqsort_i64a.cc.o
In file included from ../../subprojects/highway/hwy/contrib/sort/vqsort.h:33,
from ../../subprojects/highway/hwy/contrib/sort/vqsort_i64a.cc:16:
../../subprojects/highway/hwy/base.h: In static member function ‘static uint64_t hwy::Divisor64::Div128(uint64_t, uint64_t)’:
../../subprojects/highway/hwy/base.h:3060:27: warning: ISO C++ does not support ‘__int128’ for ‘type name’ [-Wpedantic]
3060 | using u128 = unsigned __int128;
| ^~~~~~~~
../../subprojects/highway/hwy/base.h: In static member function ‘static uint64_t hwy::Divisor64::MulHigh(uint64_t, uint64_t)’:
../../subprojects/highway/hwy/base.h:3070:27: warning: ISO C++ does not support ‘__int128’ for ‘type name’ [-Wpedantic]
3070 | using u128 = unsigned __int128;
| ^~~~~~~~
[281/363] Compiling C++ object subprojects/highway/libhwy_contrib.a.p/hwy_contrib_sort_vqsort_i32a.cc.o
In file included from ../../subprojects/highway/hwy/contrib/sort/vqsort.h:33,
from ../../subprojects/highway/hwy/contrib/sort/vqsort_i32a.cc:16:
../../subprojects/highway/hwy/base.h: In static member function ‘static uint64_t hwy::Divisor64::Div128(uint64_t, uint64_t)’:
../../subprojects/highway/hwy/base.h:3060:27: warning: ISO C++ does not support ‘__int128’ for ‘type name’ [-Wpedantic]
3060 | using u128 = unsigned __int128;
| ^~~~~~~~
../../subprojects/highway/hwy/base.h: In static member function ‘static uint64_t hwy::Divisor64::MulHigh(uint64_t, uint64_t)’:
../../subprojects/highway/hwy/base.h:3070:27: warning: ISO C++ does not support ‘__int128’ for ‘type name’ [-Wpedantic]
3070 | using u128 = unsigned __int128;
| ^~~~~~~~
[282/363] Compiling C++ object subprojects/highway/libhwy_contrib.a.p/hwy_contrib_sort_vqsort_128d.cc.o
In file included from ../../subprojects/highway/hwy/contrib/sort/vqsort.h:33,
from ../../subprojects/highway/hwy/contrib/sort/vqsort_128d.cc:16:
../../subprojects/highway/hwy/base.h: In static member function ‘static uint64_t hwy::Divisor64::Div128(uint64_t, uint64_t)’:
../../subprojects/highway/hwy/base.h:3060:27: warning: ISO C++ does not support ‘__int128’ for ‘type name’ [-Wpedantic]
3060 | using u128 = unsigned __int128;
| ^~~~~~~~
../../subprojects/highway/hwy/base.h: In static member function ‘static uint64_t hwy::Divisor64::MulHigh(uint64_t, uint64_t)’:
../../subprojects/highway/hwy/base.h:3070:27: warning: ISO C++ does not support ‘__int128’ for ‘type name’ [-Wpedantic]
3070 | using u128 = unsigned __int128;
| ^~~~~~~~
[283/363] Compiling C++ object subprojects/highway/libhwy_contrib.a.p/hwy_contrib_sort_vqsort_u32a.cc.o
In file included from ../../subprojects/highway/hwy/contrib/sort/vqsort.h:33,
from ../../subprojects/highway/hwy/contrib/sort/vqsort_u32a.cc:16:
../../subprojects/highway/hwy/base.h: In static member function ‘static uint64_t hwy::Divisor64::Div128(uint64_t, uint64_t)’:
../../subprojects/highway/hwy/base.h:3060:27: warning: ISO C++ does not support ‘__int128’ for ‘type name’ [-Wpedantic]
3060 | using u128 = unsigned __int128;
| ^~~~~~~~
../../subprojects/highway/hwy/base.h: In static member function ‘static uint64_t hwy::Divisor64::MulHigh(uint64_t, uint64_t)’:
../../subprojects/highway/hwy/base.h:3070:27: warning: ISO C++ does not support ‘__int128’ for ‘type name’ [-Wpedantic]
3070 | using u128 = unsigned __int128;
| ^~~~~~~~
[284/363] Compiling C++ object subprojects/highway/libhwy_contrib.a.p/hwy_contrib_sort_vqsort_i16d.cc.o
In file included from ../../subprojects/highway/hwy/contrib/sort/vqsort.h:33,
from ../../subprojects/highway/hwy/contrib/sort/vqsort_i16d.cc:16:
../../subprojects/highway/hwy/base.h: In static member function ‘static uint64_t hwy::Divisor64::Div128(uint64_t, uint64_t)’:
../../subprojects/highway/hwy/base.h:3060:27: warning: ISO C++ does not support ‘__int128’ for ‘type name’ [-Wpedantic]
3060 | using u128 = unsigned __int128;
| ^~~~~~~~
../../subprojects/highway/hwy/base.h: In static member function ‘static uint64_t hwy::Divisor64::MulHigh(uint64_t, uint64_t)’:
../../subprojects/highway/hwy/base.h:3070:27: warning: ISO C++ does not support ‘__int128’ for ‘type name’ [-Wpedantic]
3070 | using u128 = unsigned __int128;
| ^~~~~~~~
[285/363] Compiling C++ object subprojects/highway/libhwy_contrib.a.p/hwy_contrib_sort_vqsort_u16a.cc.o
In file included from ../../subprojects/highway/hwy/contrib/sort/vqsort.h:33,
from ../../subprojects/highway/hwy/contrib/sort/vqsort_u16a.cc:16:
../../subprojects/highway/hwy/base.h: In static member function ‘static uint64_t hwy::Divisor64::Div128(uint64_t, uint64_t)’:
../../subprojects/highway/hwy/base.h:3060:27: warning: ISO C++ does not support ‘__int128’ for ‘type name’ [-Wpedantic]
3060 | using u128 = unsigned __int128;
| ^~~~~~~~
../../subprojects/highway/hwy/base.h: In static member function ‘static uint64_t hwy::Divisor64::MulHigh(uint64_t, uint64_t)’:
../../subprojects/highway/hwy/base.h:3070:27: warning: ISO C++ does not support ‘__int128’ for ‘type name’ [-Wpedantic]
3070 | using u128 = unsigned __int128;
| ^~~~~~~~
[286/363] Generating cuda fp32 code with a custom command
[287/363] Generating cuda fp16 code with a custom command
ninja: build stopped: subcommand failed.
make: *** [Makefile:23: all] Error 1